BDBM42527 2-[(E)-2-(2-methylphenyl)ethenyl]-3-(2-phenylethyl)-4-quinazolinone::2-[(E)-2-(2-methylphenyl)ethenyl]-3-(2-phenylethyl)quinazolin-4-one::2-[(E)-2-(o-tolyl)vinyl]-3-phenethyl-quinazolin-4-one::2-[2-(2-methylphenyl)vinyl]-3-(2-phenylethyl)-4(3H)-quinazolinone::MLS000583232::SMR000201066::cid_5740982
SMILES Cc1ccccc1\C=C\c1nc2ccccc2c(=O)n1CCc1ccccc1
InChI Key InChIKey=QZHYYAXVPJEMJL-FOCLMDBBSA-N
Data  2 IC50
  Tab Delimited (TSV)   2D SDfile   Computed 3D by Vconf -m prep SDfile
Find this compound or compounds like it in BindingDB:
Activity Spreadsheet -- Enzyme Inhibition Constant Data from BindingDB
Found 2 hits for monomerid = 42527
TargetNeuropilin-1(Homo sapiens (Human))
Burnham Center For Chemical Genomics
Curated by PubChem BioAssay
LigandPNGBDBM42527(2-[(E)-2-(2-methylphenyl)ethenyl]-3-(2-phenylethyl...)
Affinity DataIC50: >9.50E+4nM
In DepthDetails PCBioAssay
TargetNeuropeptide Y receptor type 1(Homo sapiens (Human))
The Scripps Research Institute Molecular Screening Center
Curated by PubChem BioAssay
LigandPNGBDBM42527(2-[(E)-2-(2-methylphenyl)ethenyl]-3-(2-phenylethyl...)
Affinity DataIC50:  4.26E+3nM. Assay description: Source (MLSCN Center Name): The Scripps Research Institute Molecular Screening Center Affiliation: The Scripps Research Institute, TSRI Assay Provide...
In DepthDetails PCBioAssay