BDBM42531 Furan-2-carboxylic acid {3-[(3,5-dibromo-2-hydroxy-benzylidene)-amino]-phenyl}-amide::MLS000547733::N-[3-[[(E)-(3,5-dibromo-6-keto-cyclohexa-2,4-dien-1-ylidene)methyl]amino]phenyl]-2-furamide::N-[3-[[(E)-(3,5-dibromo-6-oxo-1-cyclohexa-2,4-dienylidene)methyl]amino]phenyl]-2-furancarboxamide::N-[3-[[(E)-(3,5-dibromo-6-oxocyclohexa-2,4-dien-1-ylidene)methyl]amino]phenyl]furan-2-carboxamide::N-[3-[[(E)-[3,5-bis(bromanyl)-6-oxidanylidene-cyclohexa-2,4-dien-1-ylidene]methyl]amino]phenyl]furan-2-carboxamide::SMR000171291::cid_5447857
SMILES Oc1c(Br)cc(Br)cc1C=Nc1cccc(NC(=O)c2ccco2)c1
InChI Key InChIKey=IFMBFHZZIVZGTG-UHFFFAOYSA-N
Data  1 IC50
  Tab Delimited (TSV)   2D SDfile   Computed 3D by Vconf -m prep SDfile
Find this compound or compounds like it in BindingDB:
Activity Spreadsheet -- Enzyme Inhibition Constant Data from BindingDB
Found 1 hit for monomerid = 42531
TargetNeuropeptide Y receptor type 1(Homo sapiens (Human))
The Scripps Research Institute Molecular Screening Center
Curated by PubChem BioAssay
LigandPNGBDBM42531(Furan-2-carboxylic acid {3-[(3,5-dibromo-2-hydroxy...)
Affinity DataIC50: >3.50E+4nM. Assay description: Source (MLSCN Center Name): The Scripps Research Institute Molecular Screening Center Affiliation: The Scripps Research Institute, TSRI Assay Provide...
In DepthDetails PCBioAssay