BDBM42564 MLS000698938::N-(4-bromo-2-methylphenyl)-N'-hexanoylthiourea::N-[(4-bromanyl-2-methyl-phenyl)carbamothioyl]hexanamide::N-[(4-bromo-2-methyl-phenyl)thiocarbamoyl]hexanamide::N-[(4-bromo-2-methylanilino)-sulfanylidenemethyl]hexanamide::N-[(4-bromo-2-methylphenyl)carbamothioyl]hexanamide::SMR000228865::cid_1798157
SMILES CCCCCC(=O)NC(=S)Nc1ccc(Br)cc1C
InChI Key InChIKey=YNOAVDATUQSRBU-UHFFFAOYSA-N
Data  1 IC50
  Tab Delimited (TSV)   2D SDfile   Computed 3D by Vconf -m prep SDfile
Find this compound or compounds like it in BindingDB:
Activity Spreadsheet -- Enzyme Inhibition Constant Data from BindingDB
Found 1 hit for monomerid = 42564
TargetNeuropeptide Y receptor type 1(Homo sapiens (Human))
The Scripps Research Institute Molecular Screening Center
Curated by PubChem BioAssay
LigandPNGBDBM42564(MLS000698938 | N-(4-bromo-2-methylphenyl)-N'-h...)
Affinity DataIC50:  7.66E+3nM. Assay description: Source (MLSCN Center Name): The Scripps Research Institute Molecular Screening Center Affiliation: The Scripps Research Institute, TSRI Assay Provide...
In DepthDetails PCBioAssay