BDBM426362 US10526325, Compound A38::US10829489, Compound A38::US11261185, Example 38
SMILES C[C@@H]1CN(Cc2cnn(C3CCC(O)CC3)c12)C(=O)[C@@](C)(O)C(F)(F)F
InChI Key InChIKey=QYLLNFSIIZLMHR-VHBSBENZSA-N
Data  3 IC50  2 Kd
  Tab Delimited (TSV)   2D SDfile   Computed 3D by Vconf -m prep SDfile
Find this compound or compounds like it in BindingDB:
Activity Spreadsheet -- Enzyme Inhibition Constant Data from BindingDB
Found 5 hits for monomerid = 426362
LigandPNGBDBM426362(US10526325, Compound A38 | US10829489, Compound A3...)
Affinity DataIC50: <300nM. Assay description: ITC measurements were performed with a VP-ITC micro calorimeter. In general titrations were performed by titrating the protein (50 μM) to the te...
Ligand InfoPC cidPC sid
In DepthDetails US Patent
LigandPNGBDBM426362(US10526325, Compound A38 | US10829489, Compound A3...)
Affinity DataKd: <300nM. Assay description: The biochemical activity assay for PDHK2 is based on the inactivation of PDC through phosphorylation by PDHK2. The assay is run in two steps: the enz...
Ligand InfoPC cidPC sid
In DepthDetails US Patent
LigandPNGBDBM426362(US10526325, Compound A38 | US10829489, Compound A3...)
Affinity DataIC50: <300nM. Assay description: The biochemical activity assay for PDHK2 is based on the inactivation of PDC through phosphorylation by PDHK2. The assay is run in two steps: the enz...
Ligand InfoPC cidPC sid
In DepthDetails US Patent
LigandPNGBDBM426362(US10526325, Compound A38 | US10829489, Compound A3...)
Affinity DataKd: <300nM. Assay description: ITC measurements were performed with a VP-ITC micro calorimeter (Microcal, LLC/GE Healthcare Bio-Sciences AB, Uppsala, Sweden). In general titrations...
Ligand InfoPC cidPC sid
In DepthDetails US Patent
LigandPNGBDBM426362(US10526325, Compound A38 | US10829489, Compound A3...)
Affinity DataIC50: <300nM. Assay description: The PDC inactivation assay is performed in Greiner 384-well microtiter plates and is used for high throughput screen. 4 μl of PDHK2 (human, rec,...
Ligand InfoPC cidPC sid
In DepthDetails US Patent