BDBM42722 MLS000092668::N-(3,4-dimethoxyphenyl)-3-(3-methoxyphenyl)-2-isoxazoline-5-carboxamide::N-(3,4-dimethoxyphenyl)-3-(3-methoxyphenyl)-4,5-dihydro-1,2-oxazole-5-carboxamide::N-(3,4-dimethoxyphenyl)-3-(3-methoxyphenyl)-4,5-dihydroisoxazole-5-carboxamide::SMR000028359::cid_3241493
SMILES COc1cccc(c1)C1=NOC(C1)C(=O)Nc1ccc(OC)c(OC)c1
InChI Key InChIKey=RUSNEHISXMHECV-UHFFFAOYSA-N
Data  1 IC50
  Tab Delimited (TSV)   2D SDfile   Computed 3D by Vconf -m prep SDfile
Find this compound or compounds like it in BindingDB:
Activity Spreadsheet -- Enzyme Inhibition Constant Data from BindingDB
Found 1 hit for monomerid = 42722
TargetMitogen-activated protein kinase 10(Homo sapiens (Human))
The Scripps Research Institute Molecular Screening Center
Curated by PubChem BioAssay
LigandPNGBDBM42722(MLS000092668 | N-(3,4-dimethoxyphenyl)-3-(3-methox...)
Affinity DataIC50:  4.60E+3nM. Assay description: Source (MLSCN Center Name): The Scripps Research Institute Molecular Screening Center Affiliation: The Scripps Research Institute, TSRI Assay Provide...
In DepthDetails PCBioAssay