BDBM42744 MLS000045446::N-(2-furanylmethyl)-1-methyl-4-oxo-5H-pyrrolo[3,2-c]quinoline-2-carboxamide::N-(2-furfuryl)-4-keto-1-methyl-5H-pyrrolo[3,2-c]quinoline-2-carboxamide::N-(2-furylmethyl)-1-methyl-4-oxo-4,5-dihydro-1H-pyrrolo[3,2-c]quinoline-2-carboxamide::N-(furan-2-ylmethyl)-1-methyl-4-oxidanylidene-5H-pyrrolo[3,2-c]quinoline-2-carboxamide::N-(furan-2-ylmethyl)-1-methyl-4-oxo-5H-pyrrolo[3,2-c]quinoline-2-carboxamide::SMR000027206::cid_3243455
SMILES Cn1c(cc2c1c1ccccc1[nH]c2=O)C(=O)NCc1ccco1
InChI Key InChIKey=OQVSVPSMGQBUMJ-UHFFFAOYSA-N
Data  1 IC50  3 EC50
  Tab Delimited (TSV)   2D SDfile   Computed 3D by Vconf -m prep SDfile
Find this compound or compounds like it in BindingDB:
Activity Spreadsheet -- Enzyme Inhibition Constant Data from BindingDB
Found 4 hits for monomerid = 42744
TargetNuclear receptor coactivator 3(Homo sapiens (Human))
The Scripps Research Institute Molecular Screening Center
Curated by PubChem BioAssay
LigandPNGBDBM42744(MLS000045446 | N-(2-furanylmethyl)-1-methyl-4-oxo-...)
Affinity DataEC50: >7.94E+4nM. Assay description: Source (MLSCN Center Name): The Scripps Research Institute Molecular Screening Center http://molscreen.florida.scripps.edu/ Center Affiliation: The ...
In DepthDetails PCBioAssay
TargetNuclear receptor coactivator 1(Homo sapiens (Human))
The Scripps Research Institute Molecular Screening Center
Curated by PubChem BioAssay
LigandPNGBDBM42744(MLS000045446 | N-(2-furanylmethyl)-1-methyl-4-oxo-...)
Affinity DataEC50: >7.94E+4nM. Assay description: Source (MLSCN Center Name): The Scripps Research Institute Molecular Screening Center Center Affiliation: The Scripps Research Institute (TSRI) Assay...
In DepthDetails PCBioAssay
TargetNuclear receptor coactivator 2(Homo sapiens (Human))
The Scripps Research Institute Molecular Screening Center
Curated by PubChem BioAssay
LigandPNGBDBM42744(MLS000045446 | N-(2-furanylmethyl)-1-methyl-4-oxo-...)
Affinity DataEC50: >7.94E+4nM. Assay description: Source (MLSCN Center Name): The Scripps Research Institute Molecular Screening Center Center Affiliation: The Scripps Research Institute (TSRI) Assay...
In DepthDetails PCBioAssay
TargetMitogen-activated protein kinase 10(Homo sapiens (Human))
The Scripps Research Institute Molecular Screening Center
Curated by PubChem BioAssay
LigandPNGBDBM42744(MLS000045446 | N-(2-furanylmethyl)-1-methyl-4-oxo-...)
Affinity DataIC50:  3.14E+4nM. Assay description: Source (MLSCN Center Name): The Scripps Research Institute Molecular Screening Center Affiliation: The Scripps Research Institute, TSRI Assay Provide...
In DepthDetails PCBioAssay