BDBM42791 2-[(4-fluorobenzyl)thio]-4-(2-furyl)-6-oxo-1,6-dihydro-5-pyrimidinecarbonitrile::2-[(4-fluorobenzyl)thio]-6-(2-furyl)-4-keto-1H-pyrimidine-5-carbonitrile::2-[(4-fluorophenyl)methylsulfanyl]-6-(furan-2-yl)-4-oxidanylidene-1H-pyrimidine-5-carbonitrile::2-[(4-fluorophenyl)methylsulfanyl]-6-(furan-2-yl)-4-oxo-1H-pyrimidine-5-carbonitrile::2-[(4-fluorophenyl)methylthio]-6-(2-furanyl)-4-oxo-1H-pyrimidine-5-carbonitrile::MLS000065058::SMR000078436::cid_974019
SMILES Fc1ccc(CSc2nc(-c3ccco3)c(C#N)c(=O)[nH]2)cc1
InChI Key InChIKey=DXRLBFPEYLCEPQ-UHFFFAOYSA-N
Data  2 IC50
  Tab Delimited (TSV)   2D SDfile   Computed 3D by Vconf -m prep SDfile
Find this compound or compounds like it in BindingDB:
Activity Spreadsheet -- Enzyme Inhibition Constant Data from BindingDB
Found 2 hits for monomerid = 42791
TargetMajor prion protein(Homo sapiens (Human))
The Scripps Research Institute Molecular Screening Center
Curated by PubChem BioAssay
LigandPNGBDBM42791(2-[(4-fluorobenzyl)thio]-4-(2-furyl)-6-oxo-1,6-dih...)
Affinity DataIC50:  1.03E+3nM. Assay description: Source (MLPCN Center Name): The Scripps Research Institute Molecular Screening Center (SRIMSC) Affiliation: The Scripps Research Institute, TSRI Assa...
In DepthDetails PCBioAssay
TargetMitogen-activated protein kinase 10(Homo sapiens (Human))
The Scripps Research Institute Molecular Screening Center
Curated by PubChem BioAssay
LigandPNGBDBM42791(2-[(4-fluorobenzyl)thio]-4-(2-furyl)-6-oxo-1,6-dih...)
Affinity DataIC50:  1.36E+4nM. Assay description: Source (MLSCN Center Name): The Scripps Research Institute Molecular Screening Center Affiliation: The Scripps Research Institute, TSRI Assay Provide...
In DepthDetails PCBioAssay