BDBM42913 3-(3-morpholin-4-ylpropyl)-2-phenyl-quinazolin-4-one::3-(3-morpholin-4-ylpropyl)-2-phenylquinazolin-4-one::3-(3-morpholinopropyl)-2-phenyl-quinazolin-4-one::3-[3-(4-morpholinyl)propyl]-2-phenyl-4-quinazolinone::MLS000084161::SMR000048051::cid_666734
SMILES O=c1n(CCCN2CCOCC2)c(nc2ccccc12)-c1ccccc1
InChI Key InChIKey=NFZRCUFUBRDVTD-UHFFFAOYSA-N
Data  3 EC50
  Tab Delimited (TSV)   2D SDfile   Computed 3D by Vconf -m prep SDfile
Find this compound or compounds like it in BindingDB:
Activity Spreadsheet -- Enzyme Inhibition Constant Data from BindingDB
Found 3 hits for monomerid = 42913
TargetNuclear receptor coactivator 3(Homo sapiens (Human))
The Scripps Research Institute Molecular Screening Center
Curated by PubChem BioAssay
LigandPNGBDBM42913(3-(3-morpholin-4-ylpropyl)-2-phenyl-quinazolin-4-o...)
Affinity DataEC50: >7.94E+4nM. Assay description: Source (MLSCN Center Name): The Scripps Research Institute Molecular Screening Center http://molscreen.florida.scripps.edu/ Center Affiliation: The ...
In DepthDetails PCBioAssay
TargetNuclear receptor coactivator 1(Homo sapiens (Human))
The Scripps Research Institute Molecular Screening Center
Curated by PubChem BioAssay
LigandPNGBDBM42913(3-(3-morpholin-4-ylpropyl)-2-phenyl-quinazolin-4-o...)
Affinity DataEC50: >7.94E+4nM. Assay description: Source (MLSCN Center Name): The Scripps Research Institute Molecular Screening Center Center Affiliation: The Scripps Research Institute (TSRI) Assay...
In DepthDetails PCBioAssay
TargetNuclear receptor coactivator 2(Homo sapiens (Human))
The Scripps Research Institute Molecular Screening Center
Curated by PubChem BioAssay
LigandPNGBDBM42913(3-(3-morpholin-4-ylpropyl)-2-phenyl-quinazolin-4-o...)
Affinity DataEC50: >7.94E+4nM. Assay description: Source (MLSCN Center Name): The Scripps Research Institute Molecular Screening Center Center Affiliation: The Scripps Research Institute (TSRI) Assay...
In DepthDetails PCBioAssay