BDBM429342 jm5b01461, Compound 159
SMILES CCC(=O)Nc1ccc(cc1)N(C(C(=O)NC(C)(C)C)c1ccn(C)c1)C(=O)Cn1nnc2ccccc12
InChI Key InChIKey=RDLGHIVHQIUESK-UHFFFAOYSA-N
Data  1 IC50
  Tab Delimited (TSV)   2D SDfile   Computed 3D by Vconf -m prep SDfile
Find this compound or compounds like it in BindingDB:
Activity Spreadsheet -- Enzyme Inhibition Constant Data from BindingDB
Found 1 hit for monomerid = 429342
TargetReplicase polyprotein 1ab(Human SARS coronavirus (SARS-CoV) (Severe acute re...)
University Of Bonn
LigandPNGBDBM429342(jm5b01461, Compound 159)
Affinity DataIC50:  6.90E+3nM. Assay description: This is a review article.
Ligand InfoPC cidPC sid
In DepthDetails ArticlePubMed