BDBM42942 2-[3-(4-fluorophenyl)triazolo[4,5-d]pyrimidin-7-yl]sulfanyl-N-(furan-2-ylmethyl)acetamide::2-[[3-(4-fluorophenyl)-7-triazolo[4,5-d]pyrimidinyl]thio]-N-(2-furanylmethyl)acetamide::2-[[3-(4-fluorophenyl)-[1,2,3]triazolo[4,5-d]pyrimidin-7-yl]sulfanyl]-N-(furan-2-ylmethyl)ethanamide::2-[[3-(4-fluorophenyl)triazolo[4,5-d]pyrimidin-7-yl]thio]-N-(2-furfuryl)acetamide::2-{[3-(4-fluorophenyl)-3H-[1,2,3]triazolo[4,5-d]pyrimidin-7-yl]thio}-N-(2-furylmethyl)acetamide::MLS000094046::SMR000029661::cid_3245835
SMILES Fc1ccc(cc1)-n1nnc2c(SCC(=O)NCc3ccco3)ncnc12
InChI Key InChIKey=GHFZOGQLDARQCR-UHFFFAOYSA-N
Data  3 EC50
  Tab Delimited (TSV)   2D SDfile   Computed 3D by Vconf -m prep SDfile
Find this compound or compounds like it in BindingDB:
Activity Spreadsheet -- Enzyme Inhibition Constant Data from BindingDB
Found 3 hits for monomerid = 42942
TargetNuclear receptor coactivator 3(Homo sapiens (Human))
The Scripps Research Institute Molecular Screening Center
Curated by PubChem BioAssay
LigandPNGBDBM42942(2-[3-(4-fluorophenyl)triazolo[4,5-d]pyrimidin-7-yl...)
Affinity DataEC50: >7.94E+4nM. Assay description: Source (MLSCN Center Name): The Scripps Research Institute Molecular Screening Center http://molscreen.florida.scripps.edu/ Center Affiliation: The ...
In DepthDetails PCBioAssay
TargetNuclear receptor coactivator 1(Homo sapiens (Human))
The Scripps Research Institute Molecular Screening Center
Curated by PubChem BioAssay
LigandPNGBDBM42942(2-[3-(4-fluorophenyl)triazolo[4,5-d]pyrimidin-7-yl...)
Affinity DataEC50: >7.94E+4nM. Assay description: Source (MLSCN Center Name): The Scripps Research Institute Molecular Screening Center Center Affiliation: The Scripps Research Institute (TSRI) Assay...
In DepthDetails PCBioAssay
TargetNuclear receptor coactivator 2(Homo sapiens (Human))
The Scripps Research Institute Molecular Screening Center
Curated by PubChem BioAssay
LigandPNGBDBM42942(2-[3-(4-fluorophenyl)triazolo[4,5-d]pyrimidin-7-yl...)
Affinity DataEC50: >7.94E+4nM. Assay description: Source (MLSCN Center Name): The Scripps Research Institute Molecular Screening Center Center Affiliation: The Scripps Research Institute (TSRI) Assay...
In DepthDetails PCBioAssay