BDBM429426 acs.jmedchem.1c00409_ST.429::med.21724, Compound 99
SMILES Clc1cncc(OC(=O)c2cccc3cc[nH]c23)c1
InChI Key InChIKey=FDPMNGSSFLFBSI-UHFFFAOYSA-N
Data  3 IC50  2 EC50
  Tab Delimited (TSV)   2D SDfile   Computed 3D by Vconf -m prep SDfile
Find this compound or compounds like it in BindingDB:
Activity Spreadsheet -- Enzyme Inhibition Constant Data from BindingDB
Found 5 hits for monomerid = 429426
TargetReplicase polyprotein 1ab(Human SARS coronavirus (SARS-CoV) (Severe acute re...)
University Of Bonn
LigandPNGBDBM429426(acs.jmedchem.1c00409_ST.429 | med.21724, Compound ...)
Affinity DataIC50:  80nM. Assay description: This is a review article.
Ligand InfoPC cidPC sid
In DepthDetails ArticlePubMed
TargetReplicase polyprotein 1ab(Human SARS coronavirus (SARS-CoV) (Severe acute re...)
University Of Bonn
LigandPNGBDBM429426(acs.jmedchem.1c00409_ST.429 | med.21724, Compound ...)
Affinity DataEC50:  1.21E+4nM. Assay description: This is a review article.
Ligand InfoPC cidPC sid
In DepthDetails ArticlePubMed
TargetReplicase polyprotein 1ab(2019-nCoV)
Michigan State University
LigandPNGBDBM429426(acs.jmedchem.1c00409_ST.429 | med.21724, Compound ...)
Affinity DataIC50:  56nM. Assay description: This is a review article. Please point to the original journal.
Ligand InfoPC cidPC sid
In DepthDetails ArticlePubMed
TargetReplicase polyprotein 1ab(Human SARS coronavirus (SARS-CoV) (Severe acute re...)
University Of Bonn
LigandPNGBDBM429426(acs.jmedchem.1c00409_ST.429 | med.21724, Compound ...)
Affinity DataIC50:  80nM. Assay description: This is a review article. Please point to the original journal.
Ligand InfoPC cidPC sid
In DepthDetails ArticlePubMed
TargetReplicase polyprotein 1ab(Human SARS coronavirus (SARS-CoV) (Severe acute re...)
University Of Bonn
LigandPNGBDBM429426(acs.jmedchem.1c00409_ST.429 | med.21724, Compound ...)
Affinity DataEC50:  1.21E+4nM. Assay description: This is a review article. Please point to the original journal.
Ligand InfoPC cidPC sid
In DepthDetails ArticlePubMed