BDBM43077 1-(1,5-dimethyl-3-oxidanylidene-2-phenyl-pyrazol-4-yl)-3-(2,6-dimethylphenyl)thiourea::1-(1,5-dimethyl-3-oxo-2-phenyl-4-pyrazolyl)-3-(2,6-dimethylphenyl)thiourea::1-(1,5-dimethyl-3-oxo-2-phenylpyrazol-4-yl)-3-(2,6-dimethylphenyl)thiourea::1-(2,6-dimethylphenyl)-3-(3-keto-1,5-dimethyl-2-phenyl-3-pyrazolin-4-yl)thiourea::MLS000583054::N-(1,5-dimethyl-3-oxo-2-phenyl-2,3-dihydro-1H-pyrazol-4-yl)-N'-(2,6-dimethylphenyl)thiourea::SMR000206240::cid_12005094
SMILES Cc1c(NC(=S)Nc2c(C)cccc2C)c(=O)n(-c2ccccc2)n1C
InChI Key InChIKey=HEUIFFFEXBRANX-UHFFFAOYSA-N
Data  3 EC50
  Tab Delimited (TSV)   2D SDfile   Computed 3D by Vconf -m prep SDfile
Find this compound or compounds like it in BindingDB:
Activity Spreadsheet -- Enzyme Inhibition Constant Data from BindingDB
Found 3 hits for monomerid = 43077
TargetNuclear receptor coactivator 1(Homo sapiens (Human))
The Scripps Research Institute Molecular Screening Center
Curated by PubChem BioAssay
LigandPNGBDBM43077(1-(1,5-dimethyl-3-oxidanylidene-2-phenyl-pyrazol-4...)
Affinity DataEC50: >7.94E+4nM. Assay description: Source (MLSCN Center Name): The Scripps Research Institute Molecular Screening Center Center Affiliation: The Scripps Research Institute (TSRI) Assay...
In DepthDetails PCBioAssay
TargetNuclear receptor coactivator 2(Homo sapiens (Human))
The Scripps Research Institute Molecular Screening Center
Curated by PubChem BioAssay
LigandPNGBDBM43077(1-(1,5-dimethyl-3-oxidanylidene-2-phenyl-pyrazol-4...)
Affinity DataEC50: >7.94E+4nM. Assay description: Source (MLSCN Center Name): The Scripps Research Institute Molecular Screening Center Center Affiliation: The Scripps Research Institute (TSRI) Assay...
In DepthDetails PCBioAssay
TargetNuclear receptor coactivator 3(Homo sapiens (Human))
The Scripps Research Institute Molecular Screening Center
Curated by PubChem BioAssay
LigandPNGBDBM43077(1-(1,5-dimethyl-3-oxidanylidene-2-phenyl-pyrazol-4...)
Affinity DataEC50: >7.94E+4nM. Assay description: Source (MLSCN Center Name): The Scripps Research Institute Molecular Screening Center http://molscreen.florida.scripps.edu/ Center Affiliation: The ...
In DepthDetails PCBioAssay