BDBM43133 2-phenoxy-N-tosyl-acetamide::MLS000621631::N-(4-methylphenyl)sulfonyl-2-phenoxy-ethanamide::N-(4-methylphenyl)sulfonyl-2-phenoxyacetamide::N-[(4-methylphenyl)sulfonyl]-2-phenoxyacetamide::SMR000299811::cid_829874
SMILES Cc1ccc(cc1)S(=O)(=O)NC(=O)COc1ccccc1
InChI Key InChIKey=PAEAZBRZRLRWIS-UHFFFAOYSA-N
Data  3 EC50
  Tab Delimited (TSV)   2D SDfile   Computed 3D by Vconf -m prep SDfile
Find this compound or compounds like it in BindingDB:
Activity Spreadsheet -- Enzyme Inhibition Constant Data from BindingDB
Found 3 hits for monomerid = 43133
TargetNuclear receptor coactivator 2(Homo sapiens (Human))
The Scripps Research Institute Molecular Screening Center
Curated by PubChem BioAssay
LigandPNGBDBM43133(2-phenoxy-N-tosyl-acetamide | MLS000621631 | N-(4-...)
Affinity DataEC50: >7.94E+4nM. Assay description: Source (MLSCN Center Name): The Scripps Research Institute Molecular Screening Center Center Affiliation: The Scripps Research Institute (TSRI) Assay...
In DepthDetails PCBioAssay
TargetNuclear receptor coactivator 3(Homo sapiens (Human))
The Scripps Research Institute Molecular Screening Center
Curated by PubChem BioAssay
LigandPNGBDBM43133(2-phenoxy-N-tosyl-acetamide | MLS000621631 | N-(4-...)
Affinity DataEC50: >7.94E+4nM. Assay description: Source (MLSCN Center Name): The Scripps Research Institute Molecular Screening Center http://molscreen.florida.scripps.edu/ Center Affiliation: The ...
In DepthDetails PCBioAssay
TargetNuclear receptor coactivator 1(Homo sapiens (Human))
The Scripps Research Institute Molecular Screening Center
Curated by PubChem BioAssay
LigandPNGBDBM43133(2-phenoxy-N-tosyl-acetamide | MLS000621631 | N-(4-...)
Affinity DataEC50: >7.94E+4nM. Assay description: Source (MLSCN Center Name): The Scripps Research Institute Molecular Screening Center Center Affiliation: The Scripps Research Institute (TSRI) Assay...
In DepthDetails PCBioAssay