BDBM43148 MLS000675692::N-[[4-(propanoylcarbamothioylamino)phenyl]carbamothioyl]benzamide::N-[[4-(propionylthiocarbamoylamino)phenyl]thiocarbamoyl]benzamide::N-[[4-[[(1-oxopropylamino)-sulfanylidenemethyl]amino]anilino]-sulfanylidenemethyl]benzamide::N-{[(4-{[(propionylamino)carbonothioyl]amino}phenyl)amino]carbonothioyl}benzamide::SMR000292075::cid_1314274
SMILES CCC(=O)NC(=S)Nc1ccc(NC(=S)NC(=O)c2ccccc2)cc1
InChI Key InChIKey=RLWFMLFVYYAAOA-UHFFFAOYSA-N
Data  4 EC50
  Tab Delimited (TSV)   2D SDfile   Computed 3D by Vconf -m prep SDfile
Find this compound or compounds like it in BindingDB:
Activity Spreadsheet -- Enzyme Inhibition Constant Data from BindingDB
Found 4 hits for monomerid = 43148
TargetNuclear receptor coactivator 2(Homo sapiens (Human))
The Scripps Research Institute Molecular Screening Center
Curated by PubChem BioAssay
LigandPNGBDBM43148(MLS000675692 | N-[[4-(propanoylcarbamothioylamino)...)
Affinity DataEC50: >7.94E+4nM. Assay description: Source (MLSCN Center Name): The Scripps Research Institute Molecular Screening Center Center Affiliation: The Scripps Research Institute (TSRI) Assay...
In DepthDetails PCBioAssay
TargetStreptokinase A(Streptococcus pyogenes M1 GAS)
Broad Institute
Curated by PubChem BioAssay
LigandPNGBDBM43148(MLS000675692 | N-[[4-(propanoylcarbamothioylamino)...)
Affinity DataEC50:  1.50E+5nM. Assay description: Keywords: Group A streptococcus, GAS, streptokinase, expression, virulence, inhibition, dose response, EC50 Assay Overview: The goal of this assa...
In DepthDetails PCBioAssay
TargetNuclear receptor coactivator 3(Homo sapiens (Human))
The Scripps Research Institute Molecular Screening Center
Curated by PubChem BioAssay
LigandPNGBDBM43148(MLS000675692 | N-[[4-(propanoylcarbamothioylamino)...)
Affinity DataEC50: >7.94E+4nM. Assay description: Source (MLSCN Center Name): The Scripps Research Institute Molecular Screening Center http://molscreen.florida.scripps.edu/ Center Affiliation: The ...
In DepthDetails PCBioAssay
TargetNuclear receptor coactivator 1(Homo sapiens (Human))
The Scripps Research Institute Molecular Screening Center
Curated by PubChem BioAssay
LigandPNGBDBM43148(MLS000675692 | N-[[4-(propanoylcarbamothioylamino)...)
Affinity DataEC50: >7.94E+4nM. Assay description: Source (MLSCN Center Name): The Scripps Research Institute Molecular Screening Center Center Affiliation: The Scripps Research Institute (TSRI) Assay...
In DepthDetails PCBioAssay