BDBM43259 MLS000621545::N-({[4-({[amino(imino)methyl]amino}sulfonyl)phenyl]amino}carbonothioyl)-1,3-benzodioxole-5-carboxamide::N-[(4-guanidinosulfonylphenyl)thiocarbamoyl]-piperonylamide::N-[[4-(diaminomethylideneamino)sulfonylanilino]-sulfanylidenemethyl]-1,3-benzodioxole-5-carboxamide::N-[[4-(diaminomethylideneamino)sulfonylphenyl]carbamothioyl]-1,3-benzodioxole-5-carboxamide::N-[[4-[bis(azanyl)methylideneamino]sulfonylphenyl]carbamothioyl]-1,3-benzodioxole-5-carboxamide::SMR000299720::cid_1991728
SMILES NC(=N)NS(=O)(=O)c1ccc(NC(=S)NC(=O)c2ccc3OCOc3c2)cc1
InChI Key InChIKey=QHYNODSDBUNAIJ-UHFFFAOYSA-N
Data  1 IC50  2 EC50
  Tab Delimited (TSV)   2D SDfile   Computed 3D by Vconf -m prep SDfile
Find this compound or compounds like it in BindingDB:
Activity Spreadsheet -- Enzyme Inhibition Constant Data from BindingDB
Found 3 hits for monomerid = 43259
TargetRas-related protein Rab-2A(Canis lupus familiaris)
Nmmlsc
Curated by PubChem BioAssay
LigandPNGBDBM43259(MLS000621545 | N-({[4-({[amino(imino)methyl]amino}...)
Affinity DataEC50:  738nM. Assay description: University of New Mexico Assay Overview: Assay Support: NIH I RO3 MH081231-01 HTS to identify specific small molecule inhibitors of Ras and Ras-rela...
In DepthDetails PCBioAssay
TargetMajor prion protein(Homo sapiens (Human))
The Scripps Research Institute Molecular Screening Center
Curated by PubChem BioAssay
LigandPNGBDBM43259(MLS000621545 | N-({[4-({[amino(imino)methyl]amino}...)
Affinity DataIC50:  1.51E+4nM. Assay description: Source (MLPCN Center Name): The Scripps Research Institute Molecular Screening Center (SRIMSC) Affiliation: The Scripps Research Institute, TSRI Assa...
In DepthDetails PCBioAssay
LigandPNGBDBM43259(MLS000621545 | N-({[4-({[amino(imino)methyl]amino}...)
Affinity DataEC50:  2.80E+3nM. Assay description: University of New Mexico Assay Overview: Assay Support: NIH I RO3 MH081231-01 HTS to identify specific small molecule inhibitors of Ras and Ras-rela...
In DepthDetails PCBioAssay