BDBM43278 1-[2-(2-isopropyl-5-methyl-phenoxy)ethyl]indole-3-carboxylic acid::1-[2-(5-methyl-2-propan-2-yl-phenoxy)ethyl]indole-3-carboxylic acid::1-[2-(5-methyl-2-propan-2-ylphenoxy)ethyl]-3-indolecarboxylic acid::1-[2-(5-methyl-2-propan-2-ylphenoxy)ethyl]indole-3-carboxylic acid::UNM000011077301::cid_22332901
SMILES CC(C)c1ccc(C)cc1OCCn1cc(C(O)=O)c2ccccc12
InChI Key InChIKey=PLGGALOMMWXBQO-UHFFFAOYSA-N
Data  1 EC50
  Tab Delimited (TSV)   2D SDfile   Computed 3D by Vconf -m prep SDfile
Find this compound or compounds like it in BindingDB:
Activity Spreadsheet -- Enzyme Inhibition Constant Data from BindingDB
Found 1 hit for monomerid = 43278
LigandPNGBDBM43278(1-[2-(2-isopropyl-5-methyl-phenoxy)ethyl]indole-3-...)
Affinity DataEC50:  635nM. Assay description: University of New Mexico Assay Overview: Assay Support: NIH I RO3 MH081231-01 HTS to identify specific small molecule inhibitors of Ras and Ras-rela...
In DepthDetails PCBioAssay