BDBM43305 N-(4-hydroxy-1-naphthalenyl)benzenesulfonamide::N-(4-hydroxy-1-naphthyl)benzenesulfonamide::N-(4-hydroxynaphthalen-1-yl)benzenesulfonamide::N-(4-oxidanylnaphthalen-1-yl)benzenesulfonamide::PC-0599220::PCMD-CC-MCM-216::cid_694880
SMILES Oc1ccc(NS(=O)(=O)c2ccccc2)c2ccccc12
InChI Key InChIKey=AJVUJXJDOGXUDS-UHFFFAOYSA-N
Data  1 KI  2 IC50
  Tab Delimited (TSV)   2D SDfile   Computed 3D by Vconf -m prep SDfile
Find this compound or compounds like it in BindingDB:
Activity Spreadsheet -- Enzyme Inhibition Constant Data from BindingDB
Found 3 hits for monomerid = 43305
TargetInduced myeloid leukemia cell differentiation protein Mcl-1(Homo sapiens (Human))
University Of Michigan Medical School
Curated by ChEMBL
LigandPNGBDBM43305(N-(4-hydroxy-1-naphthalenyl)benzenesulfonamide | N...)
Affinity DataKi: >2.70E+4nM. Assay description: Displacement of Flu-BID/FAM-BID from His-tagged MCL1 (171 to 327) (unknown origin) expressed in Escherichia coli BL21(DE3) after 3 hrs by fluorescenc...
In DepthDetails ArticlePubMed
TargetDNA-directed RNA polymerase subunit beta(Escherichia coli)
Pcmd
Curated by PubChem BioAssay
LigandPNGBDBM43305(N-(4-hydroxy-1-naphthalenyl)benzenesulfonamide | N...)
Affinity DataIC50:  2.01E+4nM. Assay description: Screening Center: Penn Center for Molecular Discovery Center Affiliation: University of Pennsylvania Network: Molecular Library Screening Center Netw...
In DepthDetails PCBioAssay
TargetInduced myeloid leukemia cell differentiation protein Mcl-1(Homo sapiens (Human))
University Of Michigan Medical School
Curated by ChEMBL
LigandPNGBDBM43305(N-(4-hydroxy-1-naphthalenyl)benzenesulfonamide | N...)
Affinity DataIC50: >1.00E+5nM. Assay description: Binding affinity to His-tagged MCL1 (171 to 327) (unknown origin) expressed in Escherichia coli BL21(DE3) assessed as inhibition of MCL1-N-terminal b...
In DepthDetails ArticlePubMed