BDBM43397 2-(4-methylphenyl)-3-(3-pyridinyl)-4-quinazolinone::2-(4-methylphenyl)-3-pyridin-3-yl-quinazolin-4-one::2-(4-methylphenyl)-3-pyridin-3-ylquinazolin-4-one::2-(p-tolyl)-3-(3-pyridyl)quinazolin-4-one::3-Pyridin-3-yl-2-p-tolyl-3H-quinazolin-4-one::MLS000566980::SMR000177069::cid_743603
SMILES Cc1ccc(cc1)-c1nc2ccccc2c(=O)n1-c1cccnc1
InChI Key InChIKey=WDLCZNMICHPINJ-UHFFFAOYSA-N
Data  1 EC50
  Tab Delimited (TSV)   2D SDfile   Computed 3D by Vconf -m prep SDfile
Find this compound or compounds like it in BindingDB:
Activity Spreadsheet -- Enzyme Inhibition Constant Data from BindingDB
Found 1 hit for monomerid = 43397
TargetE3 ubiquitin-protein ligase Mdm2(Homo sapiens (Human))
Pcmd
Curated by PubChem BioAssay
LigandPNGBDBM43397(2-(4-methylphenyl)-3-(3-pyridinyl)-4-quinazolinone...)
Affinity DataEC50:  5.45E+4nM. Assay description: Molecular Library Screening Center Network (MLSCN) Penn Center for Molecular Discovery (PCMD) Assay Provider: Brent Stockwell, Columbia University ML...
In DepthDetails PCBioAssay