BDBM43456 3-methyl-N-1-naphthyl-1-phenyl-1H-pyrazole-5-carboxamide::5-methyl-N-(1-naphthalenyl)-2-phenyl-3-pyrazolecarboxamide::5-methyl-N-(1-naphthyl)-2-phenyl-pyrazole-3-carboxamide::5-methyl-N-naphthalen-1-yl-2-phenyl-pyrazole-3-carboxamide::5-methyl-N-naphthalen-1-yl-2-phenylpyrazole-3-carboxamide::MLS000731032::SMR000309407::cid_16193366
SMILES Cc1cc(C(=O)Nc2cccc3ccccc23)n(n1)-c1ccccc1
InChI Key InChIKey=BFOPHTONFPIIPJ-UHFFFAOYSA-N
Data  1 EC50
  Tab Delimited (TSV)   2D SDfile   Computed 3D by Vconf -m prep SDfile
Find this compound or compounds like it in BindingDB:
Activity Spreadsheet -- Enzyme Inhibition Constant Data from BindingDB
Found 1 hit for monomerid = 43456
TargetE3 ubiquitin-protein ligase Mdm2(Homo sapiens (Human))
Pcmd
Curated by PubChem BioAssay
LigandPNGBDBM43456(3-methyl-N-1-naphthyl-1-phenyl-1H-pyrazole-5-carbo...)
Affinity DataEC50:  2.50E+4nM. Assay description: Molecular Library Screening Center Network (MLSCN) Penn Center for Molecular Discovery (PCMD) Assay Provider: Brent Stockwell, Columbia University ML...
In DepthDetails PCBioAssay