BDBM43616 2-(2-nitrophenyl)-N-pentan-3-yl-ethanamide::2-(2-nitrophenyl)-N-pentan-3-ylacetamide::MLS000574073::N-(1-ethylpropyl)-2-(2-nitrophenyl)acetamide::SMR000195659::cid_884922
SMILES CCC(CC)NC(=O)Cc1ccccc1[N+]([O-])=O
InChI Key InChIKey=JGYCENHXKFGXSK-UHFFFAOYSA-N
Data  1 IC50  1 EC50
  Tab Delimited (TSV)   2D SDfile   Computed 3D by Vconf -m prep SDfile
Find this compound or compounds like it in BindingDB:
Activity Spreadsheet -- Enzyme Inhibition Constant Data from BindingDB
Found 2 hits for monomerid = 43616
TargetSignal transducer and activator of transcription 1-alpha/beta(Homo sapiens (Human))
The Scripps Research Institute Molecular Screening Center
Curated by PubChem BioAssay
LigandPNGBDBM43616(2-(2-nitrophenyl)-N-pentan-3-yl-ethanamide | 2-(2-...)
Affinity DataEC50: >5.57E+4nM. Assay description: Source (MLPCN Center Name): The Scripps Research Institute Molecular Screening Center Center Affiliation: The Scripps Research Institute (TSRI) Assay...
In DepthDetails PCBioAssay
TargetSignal transducer and activator of transcription 3 [702-738,740-752](Homo sapiens (Human))
The Scripps Research Institute Molecular Screening Center
Curated by PubChem BioAssay
LigandPNGBDBM43616(2-(2-nitrophenyl)-N-pentan-3-yl-ethanamide | 2-(2-...)
Affinity DataIC50: >5.57E+4nM. Assay description: Source (MLPCN Center Name): The Scripps Research Institute Molecular Screening Center Center Affiliation: The Scripps Research Institute (TSRI) Assay...
In DepthDetails PCBioAssay