BDBM43621 2-[(5E)-3-acetyl-2-methyl-5-(6-oxo-1-cyclohexa-2,4-dienylidene)-1,3,4-oxadiazolidin-2-yl]-N-phenylacetamide::2-[(5E)-3-acetyl-2-methyl-5-(6-oxocyclohexa-2,4-dien-1-ylidene)-1,3,4-oxadiazolidin-2-yl]-N-phenylacetamide::2-[(5E)-3-acetyl-5-(6-ketocyclohexa-2,4-dien-1-ylidene)-2-methyl-1,3,4-oxadiazolidin-2-yl]-N-phenyl-acetamide::2-[(5E)-3-ethanoyl-2-methyl-5-(6-oxidanylidenecyclohexa-2,4-dien-1-ylidene)-1,3,4-oxadiazolidin-2-yl]-N-phenyl-ethanamide::MLS000394782::SMR000242889::cid_11175636
SMILES CC(=O)N1N=C(OC1(C)CC(=O)Nc1ccccc1)c1ccccc1O
InChI Key InChIKey=GRXLCSNHHPZVSK-UHFFFAOYSA-N
Data  1 IC50  1 EC50
  Tab Delimited (TSV)   2D SDfile   Computed 3D by Vconf -m prep SDfile
Find this compound or compounds like it in BindingDB:
Activity Spreadsheet -- Enzyme Inhibition Constant Data from BindingDB
Found 2 hits for monomerid = 43621
TargetSignal transducer and activator of transcription 1-alpha/beta(Homo sapiens (Human))
The Scripps Research Institute Molecular Screening Center
Curated by PubChem BioAssay
LigandPNGBDBM43621(2-[(5E)-3-acetyl-2-methyl-5-(6-oxo-1-cyclohexa-2,4...)
Affinity DataEC50: >5.57E+4nM. Assay description: Source (MLPCN Center Name): The Scripps Research Institute Molecular Screening Center Center Affiliation: The Scripps Research Institute (TSRI) Assay...
In DepthDetails PCBioAssay
TargetSignal transducer and activator of transcription 3 [702-738,740-752](Homo sapiens (Human))
The Scripps Research Institute Molecular Screening Center
Curated by PubChem BioAssay
LigandPNGBDBM43621(2-[(5E)-3-acetyl-2-methyl-5-(6-oxo-1-cyclohexa-2,4...)
Affinity DataIC50: >5.57E+4nM. Assay description: Source (MLPCN Center Name): The Scripps Research Institute Molecular Screening Center Center Affiliation: The Scripps Research Institute (TSRI) Assay...
In DepthDetails PCBioAssay