BDBM43673 MLS000065628::N-[2-(1-cyclohexen-1-yl)ethyl]-2,5-dimethyl-3-furamide::N-[2-(1-cyclohexenyl)ethyl]-2,5-dimethyl-3-furancarboxamide::N-[2-(cyclohexen-1-yl)ethyl]-2,5-dimethyl-3-furamide::N-[2-(cyclohexen-1-yl)ethyl]-2,5-dimethyl-furan-3-carboxamide::N-[2-(cyclohexen-1-yl)ethyl]-2,5-dimethylfuran-3-carboxamide::SMR000080267::cid_2712666
SMILES Cc1cc(C(=O)NCCC2=CCCCC2)c(C)o1
InChI Key InChIKey=FRXPEODZTWZHDV-UHFFFAOYSA-N
Data  1 EC50
  Tab Delimited (TSV)   2D SDfile   Computed 3D by Vconf -m prep SDfile
Find this compound or compounds like it in BindingDB:
Activity Spreadsheet -- Enzyme Inhibition Constant Data from BindingDB
Found 1 hit for monomerid = 43673
TargetSignal transducer and activator of transcription 3 [702-738,740-752](Homo sapiens (Human))
The Scripps Research Institute Molecular Screening Center
Curated by PubChem BioAssay
LigandPNGBDBM43673(MLS000065628 | N-[2-(1-cyclohexen-1-yl)ethyl]-2,5-...)
Affinity DataEC50: >5.57E+4nM. Assay description: Source (MLPCN Center Name): The Scripps Research Institute Molecular Screening Center Center Affiliation: The Scripps Research Institute (TSRI) Assay...
In DepthDetails PCBioAssay