BDBM43717 4-(1-benzofuran-2-yl)-N-prop-2-enyl-1,3-thiazol-2-amine::4-(2-benzofuranyl)-N-prop-2-enyl-2-thiazolamine::MLS000389019::SMR000255193::allyl-[4-(benzofuran-2-yl)thiazol-2-yl]amine::cid_2531071
SMILES C=CCNc1nc(cs1)-c1cc2ccccc2o1
InChI Key InChIKey=GUIVINMKNHTJJH-UHFFFAOYSA-N
Data  2 EC50
  Tab Delimited (TSV)   2D SDfile   Computed 3D by Vconf -m prep SDfile
Find this compound or compounds like it in BindingDB:
Activity Spreadsheet -- Enzyme Inhibition Constant Data from BindingDB
Found 2 hits for monomerid = 43717
TargetTranscription factor p65(Homo sapiens (Human))
Srmlsc
Curated by PubChem BioAssay
LigandPNGBDBM43717(4-(1-benzofuran-2-yl)-N-prop-2-enyl-1,3-thiazol-2-...)
Affinity DataEC50:  598nM. Assay description: Southern Research Molecular Libraries Screening Center (SRMLSC) Southern Research Institute (Birmingham, Alabama) NIH Molecular Libraries Screening C...
In DepthDetails PCBioAssay
TargetSignal transducer and activator of transcription 3 [702-738,740-752](Homo sapiens (Human))
The Scripps Research Institute Molecular Screening Center
Curated by PubChem BioAssay
LigandPNGBDBM43717(4-(1-benzofuran-2-yl)-N-prop-2-enyl-1,3-thiazol-2-...)
Affinity DataEC50: >5.57E+4nM. Assay description: Source (MLPCN Center Name): The Scripps Research Institute Molecular Screening Center Center Affiliation: The Scripps Research Institute (TSRI) Assay...
In DepthDetails PCBioAssay