BDBM43735 2-methyl-N-[4-(2-methyl-1,3-thiazol-4-yl)phenyl]benzamide::2-methyl-N-[4-(2-methyl-4-thiazolyl)phenyl]benzamide::2-methyl-N-[4-(2-methylthiazol-4-yl)phenyl]benzamide::MLS000662188::SMR000293089::cid_2196790
SMILES Cc1nc(cs1)-c1ccc(NC(=O)c2ccccc2C)cc1
InChI Key InChIKey=QCKPNFMTTCKECS-UHFFFAOYSA-N
Data  1 EC50
  Tab Delimited (TSV)   2D SDfile   Computed 3D by Vconf -m prep SDfile
Find this compound or compounds like it in BindingDB:
Activity Spreadsheet -- Enzyme Inhibition Constant Data from BindingDB
Found 1 hit for monomerid = 43735
TargetSignal transducer and activator of transcription 3 [702-738,740-752](Homo sapiens (Human))
The Scripps Research Institute Molecular Screening Center
Curated by PubChem BioAssay
LigandPNGBDBM43735(2-methyl-N-[4-(2-methyl-1,3-thiazol-4-yl)phenyl]be...)
Affinity DataEC50: >5.57E+4nM. Assay description: Source (MLPCN Center Name): The Scripps Research Institute Molecular Screening Center Center Affiliation: The Scripps Research Institute (TSRI) Assay...
In DepthDetails PCBioAssay