BDBM43749 3,8-dimethoxy-6-benzo[c][1]benzopyranone::3,8-dimethoxybenzo[c]chromen-6-one::MLS001049097::SMR000386930::cid_800988
SMILES COc1ccc2c(c1)oc(=O)c1cc(OC)ccc21
InChI Key InChIKey=FTCCLANRGJOUKX-UHFFFAOYSA-N
Data  1 EC50
  Tab Delimited (TSV)   2D SDfile   Computed 3D by Vconf -m prep SDfile
Find this compound or compounds like it in BindingDB:
Activity Spreadsheet -- Enzyme Inhibition Constant Data from BindingDB
Found 1 hit for monomerid = 43749
TargetSignal transducer and activator of transcription 3 [702-738,740-752](Homo sapiens (Human))
The Scripps Research Institute Molecular Screening Center
Curated by PubChem BioAssay
LigandPNGBDBM43749(3,8-dimethoxy-6-benzo[c][1]benzopyranone | 3,8-dim...)
Affinity DataEC50: >5.57E+4nM. Assay description: Source (MLPCN Center Name): The Scripps Research Institute Molecular Screening Center Center Affiliation: The Scripps Research Institute (TSRI) Assay...
In DepthDetails PCBioAssay