BDBM438808 4-(2-(2-((2'-chloro-3'-(5-(2- hydroxyethyl)-1-methyl- 4,5,6,7-tetrahydro-1H- imidazo[4,5-c]pyridine-2- carboxamido)-2-methyl- [1,1'-biphenyl]-3- yl)carbamoyl)-1-methyl- 1,4,6,7-tetrahydro-5H- imidazo[4,5-c]pyridin-5- yl)ethyl)bicyclo[2.2.1] heptane-1-carboxylic acid::US10618916, Example 43::US10906920, Example 43::US11414433, Example 43
SMILES Cc1c(NC(=O)c2nc3CN(CCC45CCC(CC4)(C5)C(O)=O)CCc3n2C)cccc1-c1cccc(NC(=O)c2nc3CN(CCO)CCc3n2C)c1Cl
InChI Key InChIKey=QDRFZHIGJAJTEF-UHFFFAOYSA-N
Data  3 IC50
  Tab Delimited (TSV)   2D SDfile   Computed 3D by Vconf -m prep SDfile
Find this compound or compounds like it in BindingDB:
Activity Spreadsheet -- Enzyme Inhibition Constant Data from BindingDB
Found 3 hits for monomerid = 438808
TargetProgrammed cell death 1 ligand 1 [19-238]/protein 1 [25-167](Homo sapiens (Human))
Incyte
US Patent
LigandPNGBDBM438808(4-(2-(2-((2'-chloro-3'-(5-(2- hydroxyethyl)-1-meth...)
Affinity DataIC50: <5nM. Assay description: The assays were conducted in a standard black 384-well polystyrene plate with a final volume of 20 μL. Inhibitors were first serially diluted in...
Ligand InfoPC cidPC sid
In DepthDetails US Patent
TargetProgrammed cell death 1 ligand/protein 1(Homo sapiens)
Incyte
US Patent
LigandPNGBDBM438808(4-(2-(2-((2'-chloro-3'-(5-(2- hydroxyethyl)-1-meth...)
Affinity DataIC50: <5nM. Assay description: The assays were conducted in a standard black 384-well polystyrene plate with a final volume of 20 μL. Inhibitors were first serially diluted in...
Ligand InfoPC cidPC sid
In DepthDetails US Patent
TargetProgrammed cell death 1 ligand 1 [19-238]/protein 1 [25-167](Homo sapiens (Human))
Incyte
US Patent
LigandPNGBDBM438808(4-(2-(2-((2'-chloro-3'-(5-(2- hydroxyethyl)-1-meth...)
Affinity DataIC50: <5nM. Assay description: The assays were conducted in a standard black 384-well polystyrene plate with a final volume of 20 μL. Inhibitors were first serially diluted in...
Ligand InfoPC cidPC sid
In DepthDetails US Patent