BDBM43960 3-ethoxy-4-fluoranyl-N-(phenylmethyl)benzenesulfonamide::3-ethoxy-4-fluoro-N-(phenylmethyl)benzenesulfonamide::MLS000100263::N-benzyl-3-ethoxy-4-fluoro-benzenesulfonamide::N-benzyl-3-ethoxy-4-fluorobenzenesulfonamide::SMR000082281::cid_2980747
SMILES CCOc1cc(ccc1F)S(=O)(=O)NCc1ccccc1
InChI Key InChIKey=ZQVABNYNMVPRIX-UHFFFAOYSA-N
Data  3 EC50
  Tab Delimited (TSV)   2D SDfile   Computed 3D by Vconf -m prep SDfile
Find this compound or compounds like it in BindingDB:
Activity Spreadsheet -- Enzyme Inhibition Constant Data from BindingDB
Found 3 hits for monomerid = 43960
TargetSolute carrier family 12 member 5(Homo sapiens (Human))
Vanderbilt Screening Center For Gpcrs, Ion Channels And Transporters
Curated by PubChem BioAssay
LigandPNGBDBM43960(3-ethoxy-4-fluoranyl-N-(phenylmethyl)benzenesulfon...)
Affinity DataEC50:  4.68E+3nM. Assay description: Vanderbilt Screening Center for GPCRs, Ion Channels and Transporters Assay Provider: Eric Delpire Assay Provider Affliation: Vanderbilt University Gr...
In DepthDetails PCBioAssay
TargetSolute carrier family 12 member 5(Homo sapiens (Human))
Vanderbilt Screening Center For Gpcrs, Ion Channels And Transporters
Curated by PubChem BioAssay
LigandPNGBDBM43960(3-ethoxy-4-fluoranyl-N-(phenylmethyl)benzenesulfon...)
Affinity DataEC50:  5.41E+3nM. Assay description: Vanderbilt Screening Center for GPCRs, Ion Channels and Transporters Assay Provider: Eric Delpire Assay Provider Affliation: Vanderbilt University Gr...
In DepthDetails PCBioAssay
TargetSolute carrier family 12 member 5(Homo sapiens (Human))
Vanderbilt Screening Center For Gpcrs, Ion Channels And Transporters
Curated by PubChem BioAssay
LigandPNGBDBM43960(3-ethoxy-4-fluoranyl-N-(phenylmethyl)benzenesulfon...)
Affinity DataEC50:  5.92E+3nM. Assay description: Vanderbilt Screening Center for GPCRs, Ion Channels and Transporters Assay Provider: Eric Delpire Assay Provider Affliation: Vanderbilt University Gr...
In DepthDetails PCBioAssay