BDBM441820 US10647665, Example 1-9::US10851050, Example I-9
SMILES CCS(=N)(=O)c1ccc(CNC(=O)Nc2cc(Cl)c(c(Cl)c2)-c2ccccc2OC(F)(F)F)cc1
InChI Key InChIKey=KYIWYVONZDUDJR-UHFFFAOYSA-N
Data  3 IC50
  Tab Delimited (TSV)   2D SDfile   Computed 3D by Vconf -m prep SDfile
Find this compound or compounds like it in BindingDB:
Activity Spreadsheet -- Enzyme Inhibition Constant Data from BindingDB
Found 3 hits for monomerid = 441820
TargetNuclear receptor ROR-gamma(Homo sapiens (Human))
Fudan University
US Patent
LigandPNGBDBM441820(US10647665, Example 1-9 | US10851050, Example I-9)
Affinity DataIC50: <500nM. Assay description: 1. Preparation of RORgamma Buffer Solution10 mL of DTT and 100 mL buffer solution were gently mixed together and ready to use.2. Preparation of Compo...
Ligand InfoPC cidPC sid
In DepthDetails US Patent
TargetNuclear receptor ROR-gamma(Homo sapiens (Human))
Fudan University
US Patent
LigandPNGBDBM441820(US10647665, Example 1-9 | US10851050, Example I-9)
Affinity DataIC50:  200nM. Assay description: Inverse agonist activity at human RORgammat assessed as inhibition of N-terminal biotinylated co-activator SRC1 recruitment measured after 60 mins by...
Ligand InfoPC cidPC sid
In DepthDetails ArticlePubMed
TargetNuclear receptor ROR-gamma(Homo sapiens (Human))
Fudan University
US Patent
LigandPNGBDBM441820(US10647665, Example 1-9 | US10851050, Example I-9)
Affinity DataIC50: <500nM. Assay description: The inhibitory activity of compounds on RORγ receptor was determined by fluorescence resonance energy transfer (FRET) experiments. The inhibitor...
Ligand InfoPC cidPC sid
In DepthDetails US Patent