BDBM44304 MLS-0412067.0001::cid_44182181::formic acid;(2S)-2-(methylamino)-N-[(3S)-1-[2-(1-naphthalenylamino)-2-oxoethyl]-2-oxo-3-azepanyl]propanamide::formic acid;(2S)-2-(methylamino)-N-[(3S)-1-[2-(naphthalen-1-ylamino)-2-oxoethyl]-2-oxoazepan-3-yl]propanamide::formic acid;(2S)-N-[(3S)-2-keto-1-[2-keto-2-(1-naphthylamino)ethyl]azepan-3-yl]-2-(methylamino)propionamide::methanoic acid;(2S)-2-(methylamino)-N-[(3S)-1-[2-(naphthalen-1-ylamino)-2-oxidanylidene-ethyl]-2-oxidanylidene-azepan-3-yl]propanamide
SMILES CN[C@@H](C)C(=O)N[C@H]1CCCCN(CC(=O)Nc2cccc3ccccc23)C1=O
InChI Key InChIKey=BJKRLBLENJZJRC-KXBFYZLASA-N
Data  1 IC50
  Tab Delimited (TSV)   2D SDfile   Computed 3D by Vconf -m prep SDfile
Find this compound or compounds like it in BindingDB:
Activity Spreadsheet -- Enzyme Inhibition Constant Data from BindingDB
Found 1 hit for monomerid = 44304
TargetE3 ubiquitin-protein ligase XIAP(Homo sapiens (Human))
Burnham Center For Chemical Genomics
Curated by PubChem BioAssay
LigandPNGBDBM44304(MLS-0412067.0001 | cid_44182181 | formic acid;(2S)...)
Affinity DataIC50:  5.96E+4nM. Assay description: Data Source: Sanford-Burnham Center for Chemical Genomics (SBCCG) Source Affiliation: Sanford-Burnham Medical Research Institute (SBMRI, San Diego, C...
In DepthDetails PCBioAssay