BDBM44319 (2S)-N-[(1S)-1-[(2S)-2-[(3,4-dichloroanilino)carbamoyl]pyrrolidine-1-carbonyl]-2-methyl-propyl]-2-(methylamino)propionamide;formic acid::(2S)-N-[(2S)-1-[(2S)-2-[(3,4-dichloroanilino)carbamoyl]pyrrolidin-1-yl]-3-methyl-1-oxobutan-2-yl]-2-(methylamino)propanamide;formic acid::(2S)-N-[(2S)-1-[(2S)-2-[[(3,4-dichlorophenyl)amino]carbamoyl]pyrrolidin-1-yl]-3-methyl-1-oxidanylidene-butan-2-yl]-2-(methylamino)propanamide;methanoic acid::(2S)-N-[(2S)-1-[(2S)-2-[[(3,4-dichlorophenyl)hydrazo]-oxomethyl]-1-pyrrolidinyl]-3-methyl-1-oxobutan-2-yl]-2-(methylamino)propanamide;formic acid::MLS-0412154.0001::cid_44182225
SMILES CN[C@@H](C)C(=O)N[C@@H](C(C)C)C(=O)N1CCC[C@H]1C(=O)NNc1ccc(Cl)c(Cl)c1
InChI Key InChIKey=KYDHUTYZSSBXTI-ZLIFDBKOSA-N
Data  2 IC50
  Tab Delimited (TSV)   2D SDfile   Computed 3D by Vconf -m prep SDfile
Find this compound or compounds like it in BindingDB:
Activity Spreadsheet -- Enzyme Inhibition Constant Data from BindingDB
Found 2 hits for monomerid = 44319
TargetE3 ubiquitin-protein ligase XIAP(Homo sapiens (Human))
Burnham Center For Chemical Genomics
Curated by PubChem BioAssay
LigandPNGBDBM44319((2S)-N-[(1S)-1-[(2S)-2-[(3,4-dichloroanilino)carba...)
Affinity DataIC50:  4.90E+3nM. Assay description: Data Source: Sanford-Burnham Center for Chemical Genomics (SBCCG) Source Affiliation: Sanford-Burnham Medical Research Institute (SBMRI, San Diego, C...
In DepthDetails PCBioAssay
TargetE3 ubiquitin-protein ligase XIAP(Homo sapiens (Human))
Burnham Center For Chemical Genomics
Curated by PubChem BioAssay
LigandPNGBDBM44319((2S)-N-[(1S)-1-[(2S)-2-[(3,4-dichloroanilino)carba...)
Affinity DataIC50:  5.30E+3nM. Assay description: Data Source: Sanford-Burnham Center for Chemical Genomics (SBCCG) Source Affiliation: Sanford-Burnham Medical Research Institute (SBMRI, San Diego, C...
In DepthDetails PCBioAssay