BDBM44385 5-Chloro-1-phenyl-1,3-dihydro-benzoimidazol-2-one::6-chloranyl-3-phenyl-1H-benzimidazol-2-one::6-chloro-3-phenyl-1H-benzimidazol-2-one::MLS000071723::SMR000008636::cid_649443
SMILES Clc1ccc2n(-c3ccccc3)c(=O)[nH]c2c1
InChI Key InChIKey=RMPWZHBFXOLXFG-UHFFFAOYSA-N
Data  1 IC50
  Tab Delimited (TSV)   2D SDfile   Computed 3D by Vconf -m prep SDfile
Find this compound or compounds like it in BindingDB:
Activity Spreadsheet -- Enzyme Inhibition Constant Data from BindingDB
Found 1 hit for monomerid = 44385
TargetAlkaline phosphatase, tissue-nonspecific isozyme(Homo sapiens (Human))
Burnham Center For Chemical Genomics
Curated by PubChem BioAssay
LigandPNGBDBM44385(5-Chloro-1-phenyl-1,3-dihydro-benzoimidazol-2-one ...)
Affinity DataIC50:  5.34E+3nM. Assay description: Sanford-Burnham Center for Chemical Genomics (SBCCG) Sanford-Burnham Medical Research Institute (SBMRI, San Diego, CA) NIH Molecular Libraries Screen...
In DepthDetails PCBioAssay