BDBM44442 2-(1-methyl-2-benzimidazolyl)-2-[4-oxo-3-prop-2-enyl-5-[(3,4,5-trimethoxyphenyl)methylidene]-2-thiazolidinylidene]acetonitrile::2-(1-methylbenzimidazol-2-yl)-2-[4-oxidanylidene-3-prop-2-enyl-5-[(3,4,5-trimethoxyphenyl)methylidene]-1,3-thiazolidin-2-ylidene]ethanenitrile::2-(1-methylbenzimidazol-2-yl)-2-[4-oxo-3-prop-2-enyl-5-[(3,4,5-trimethoxyphenyl)methylidene]-1,3-thiazolidin-2-ylidene]acetonitrile::2-[3-allyl-4-keto-5-(3,4,5-trimethoxybenzylidene)thiazolidin-2-ylidene]-2-(1-methylbenzimidazol-2-yl)acetonitrile::MLS000098330::SMR000062493::cid_2998243
SMILES COc1cc(C=c2s\c(=C(\C#N)c3nc4ccccc4n3C)n(CC=C)c2=O)cc(OC)c1OC
InChI Key InChIKey=PZIGOHUQRSCTDW-RKFJFMBDSA-N
Data  4 IC50
  Tab Delimited (TSV)   2D SDfile   Computed 3D by Vconf -m prep SDfile
Find this compound or compounds like it in BindingDB:
Activity Spreadsheet -- Enzyme Inhibition Constant Data from BindingDB
Found 4 hits for monomerid = 44442
TargetEphrin type-A receptor 4(Mus musculus)
Sanford-Burnham Center For Chemical Genomics
Curated by PubChem BioAssay
LigandPNGBDBM44442(2-(1-methyl-2-benzimidazolyl)-2-[4-oxo-3-prop-2-en...)
Affinity DataIC50: >1.00E+5nM. Assay description: Data Source: Sanford-Burnham Center for Chemical Genomics (SBCCG) Source Affiliation: Sanford-Burnham Medical Research Institute (SBMRI, San Diego, C...
In DepthDetails PCBioAssay
TargetMannose-6-phosphate isomerase(Homo sapiens (Human))
Sanford-Burnham Medical Research Institute
Curated by ChEMBL
LigandPNGBDBM44442(2-(1-methyl-2-benzimidazolyl)-2-[4-oxo-3-prop-2-en...)
Affinity DataIC50: >1.00E+4nM. Assay description: Inhibition of human purified phosphomannose isomerase
In DepthDetails ArticlePubMed
TargetGlycoprotein 42(Human herpesvirus 4 type 2)
Emory University
Curated by PubChem BioAssay
LigandPNGBDBM44442(2-(1-methyl-2-benzimidazolyl)-2-[4-oxo-3-prop-2-en...)
Affinity DataIC50:  3.34E+3nM. Assay description: NIH Molecular Libraries Screening Centers Network [MLSCN] Emory Chemical Biology Discovery Center in MLSCN Assay provider: Theodore Jardetzky; Northw...
In DepthDetails PCBioAssay
TargetEphrin type-A receptor 4(Mus musculus)
Sanford-Burnham Center For Chemical Genomics
Curated by PubChem BioAssay
LigandPNGBDBM44442(2-(1-methyl-2-benzimidazolyl)-2-[4-oxo-3-prop-2-en...)
Affinity DataIC50: >5.00E+4nM. Assay description: Sanford-Burnham Center for Chemical Genomics (SBCCG) Sanford-Burnham Medical Research Institute (SBMRI, San Diego, CA) NIH Molecular Libraries Screen...
In DepthDetails PCBioAssay