BDBM444441 US10662159, Example 26
SMILES COc1ccc(cc1F)-c1ccc2CN(Cc2c1)C(=O)OC(C(F)(F)F)C(F)(F)F
InChI Key InChIKey=JHFMFGJLHFSJTO-UHFFFAOYSA-N
Data  4 IC50
  Tab Delimited (TSV)   2D SDfile   Computed 3D by Vconf -m prep SDfile
Find this compound or compounds like it in BindingDB:
Activity Spreadsheet -- Enzyme Inhibition Constant Data from BindingDB
Found 4 hits for monomerid = 444441
TargetMonoacylglycerol lipase ABHD6(Homo sapiens (Human))
Makscientific
US Patent
LigandPNGBDBM444441(US10662159, Example 26)
Affinity DataIC50:  55nM. Assay description: ABHD6: Certain compounds were tested for their ABHD6 and dual ABHD6/MGL inhibitory activity, which is expressed as % of inhibition or IC50 values. Th...
Ligand InfoPC cidPC sid
In DepthDetails US Patent
TargetFatty-acid amide hydrolase 1 [30-579](Rattus norvegicus (rat))
Makscientific
US Patent
LigandPNGBDBM444441(US10662159, Example 26)
Affinity DataIC50: >1.00E+3nM. Assay description: hABHD6:Initial Fluorescent Inhibition Assay (3-Point)—In each well of a 96-well plate 8 μL of membrane fraction containing full-length hABHD6 (1...
Ligand InfoPC cidPC sid
In DepthDetails US Patent
TargetFatty-acid amide hydrolase 1(Homo sapiens (Human))
Makscientific
US Patent
LigandPNGBDBM444441(US10662159, Example 26)
Affinity DataIC50: >1.00E+3nM. Assay description: Rat/homo FAAH:Procedure was followed as described for hMGL, except that arachidonoyl-methyl coumarin (was used as fluorigenic substrate. Compounds we...
Ligand InfoPC cidPC sid
In DepthDetails US Patent
TargetMonoglyceride lipase(Homo sapiens (Human))
Makscientific
US Patent
LigandPNGBDBM444441(US10662159, Example 26)
Affinity DataIC50: >1.00E+3nM. Assay description: MGL: Compound inhibition of hMGL activity was assessed by a fluorometric assay recently developed in our laboratory (Makriyannis et al WO Patent Appl...
Ligand InfoPC cidPC sid
In DepthDetails US Patent