BDBM444658 (R)-1-(1-acryloylpyrrolidin-3-yl)-3-(4-(2- fluoro-3-methoxyphenoxy)phenyl)-1H- pyrazolo[4,3-c]pyridine-7-carbonitrile::US10662187, Compound 28::US10793566, Compound 28
SMILES COc1cccc(Oc2ccc(cc2)-c2nn([C@@H]3CCN(C3)C(=O)C=C)c3c(cncc23)C#N)c1F
InChI Key InChIKey=YRVZRMZOBZWYAL-LJQANCHMSA-N
Data  2 IC50
  Tab Delimited (TSV)   2D SDfile   Computed 3D by Vconf -m prep SDfile
Find this compound or compounds like it in BindingDB:
Activity Spreadsheet -- Enzyme Inhibition Constant Data from BindingDB
Found 2 hits for monomerid = 444658
TargetTyrosine-protein kinase BTK(Homo sapiens (Human))
Zibo Biopolar Changsheng Pharmaceutical
US Patent
LigandPNGBDBM444658((R)-1-(1-acryloylpyrrolidin-3-yl)-3-(4-(2- fluoro-...)
Affinity DataIC50: <10nM. Assay description: Btk kinase activity was determined using a homogenous time resolved fluorescence (HTRF) methodology. Measurements were performed in a reaction volume...
Ligand InfoPC cidPC sid
In DepthDetails US Patent
TargetTyrosine-protein kinase BTK(Homo sapiens (Human))
Zibo Biopolar Changsheng Pharmaceutical
US Patent
LigandPNGBDBM444658((R)-1-(1-acryloylpyrrolidin-3-yl)-3-(4-(2- fluoro-...)
Affinity DataIC50: <10nM. Assay description: Measurements were performed in a reaction volume of 15 μL using 384-well assay plates. Kinase enzyme, inhibitor, ATP and 1 μM peptide subst...
Ligand InfoPC cidPC sid
In DepthDetails US Patent