BDBM444662 (R)-1-(3-(3-(4-(2-fluoro-3- methoxyphenoxy)phenyl)-1H- pyrazolo[3,4-c]pyridin-1-yl)pyrrolidin-1- yl)prop-2-en-1-one::US10662187, Compound 32::US10793566, Compound 32
SMILES COc1cccc(Oc2ccc(cc2)-c2nn([C@H]3CCN(C3)C(=O)C=C)c3ccncc23)c1F
InChI Key InChIKey=BIUOKLOCUSWJCX-SFHVURJKSA-N
Data  2 IC50
  Tab Delimited (TSV)   2D SDfile   Computed 3D by Vconf -m prep SDfile
Find this compound or compounds like it in BindingDB:
Activity Spreadsheet -- Enzyme Inhibition Constant Data from BindingDB
Found 2 hits for monomerid = 444662
TargetTyrosine-protein kinase BTK(Homo sapiens (Human))
Zibo Biopolar Changsheng Pharmaceutical
US Patent
LigandPNGBDBM444662((R)-1-(3-(3-(4-(2-fluoro-3- methoxyphenoxy)phenyl)...)
Affinity DataIC50:  55nM. Assay description: Btk kinase activity was determined using a homogenous time resolved fluorescence (HTRF) methodology. Measurements were performed in a reaction volume...
Ligand InfoPC cidPC sid
In DepthDetails US Patent
TargetTyrosine-protein kinase BTK(Homo sapiens (Human))
Zibo Biopolar Changsheng Pharmaceutical
US Patent
LigandPNGBDBM444662((R)-1-(3-(3-(4-(2-fluoro-3- methoxyphenoxy)phenyl)...)
Affinity DataIC50:  55nM. Assay description: Measurements were performed in a reaction volume of 15 μL using 384-well assay plates. Kinase enzyme, inhibitor, ATP and 1 μM peptide subst...
Ligand InfoPC cidPC sid
In DepthDetails US Patent