BDBM444663 (R)-1-(3-(3-(4-phenoxyphenyl)-1H- pyrazolo[4,3-c]pyridin-1-yl)piperidin-1- yl)prop-2-en-1-one::US10662187, Compound 33::US10793566, Compound 33
SMILES C=CC(=O)N1CCC[C@H](C1)n1nc(-c2ccc(Oc3ccccc3)cc2)c2cnccc12
InChI Key InChIKey=SSJWXVTYUQWSMN-HXUWFJFHSA-N
Data  2 IC50
  Tab Delimited (TSV)   2D SDfile   Computed 3D by Vconf -m prep SDfile
Find this compound or compounds like it in BindingDB:
Activity Spreadsheet -- Enzyme Inhibition Constant Data from BindingDB
Found 2 hits for monomerid = 444663
TargetTyrosine-protein kinase BTK(Homo sapiens (Human))
Zibo Biopolar Changsheng Pharmaceutical
US Patent
LigandPNGBDBM444663((R)-1-(3-(3-(4-phenoxyphenyl)-1H- pyrazolo[4,3-c]p...)
Affinity DataIC50: <10nM. Assay description: Btk kinase activity was determined using a homogenous time resolved fluorescence (HTRF) methodology. Measurements were performed in a reaction volume...
Ligand InfoPC cidPC sid
In DepthDetails US Patent
TargetTyrosine-protein kinase BTK(Homo sapiens (Human))
Zibo Biopolar Changsheng Pharmaceutical
US Patent
LigandPNGBDBM444663((R)-1-(3-(3-(4-phenoxyphenyl)-1H- pyrazolo[4,3-c]p...)
Affinity DataIC50: <10nM. Assay description: Measurements were performed in a reaction volume of 15 μL using 384-well assay plates. Kinase enzyme, inhibitor, ATP and 1 μM peptide subst...
Ligand InfoPC cidPC sid
In DepthDetails US Patent