BDBM44512 2-(7-Methyl-2-piperidin-1-yl-quinolin-3-ylmethylene)-malononitrile::2-[(7-methyl-2-piperidin-1-yl-quinolin-3-yl)methylidene]propanedinitrile::2-[(7-methyl-2-piperidin-1-ylquinolin-3-yl)methylidene]propanedinitrile::2-[(7-methyl-2-piperidino-3-quinolyl)methylene]malononitrile::2-[[7-methyl-2-(1-piperidinyl)-3-quinolinyl]methylidene]propanedinitrile::MLS000549748::SMR000178229::cid_1076113
SMILES [#6]-c1ccc2cc(\[#6]=[#6](\C#N)C#N)c(nc2c1)-[#7]-1-[#6]-[#6]-[#6]-[#6]-[#6]-1
InChI Key InChIKey=HIWOMFNWVDRMCN-UHFFFAOYSA-N
Data  3 IC50
  Tab Delimited (TSV)   2D SDfile   Computed 3D by Vconf -m prep SDfile
Find this compound or compounds like it in BindingDB:
Activity Spreadsheet -- Enzyme Inhibition Constant Data from BindingDB
Found 3 hits for monomerid = 44512
TargetEphrin type-A receptor 4(Mus musculus)
Sanford-Burnham Center For Chemical Genomics
Curated by PubChem BioAssay
LigandPNGBDBM44512(2-(7-Methyl-2-piperidin-1-yl-quinolin-3-ylmethylen...)
Affinity DataIC50:  2.44E+4nM. Assay description: Data Source: Sanford-Burnham Center for Chemical Genomics (SBCCG) Source Affiliation: Sanford-Burnham Medical Research Institute (SBMRI, San Diego, C...
In DepthDetails PCBioAssay
TargetGlycoprotein 42(Human herpesvirus 4 type 2)
Emory University
Curated by PubChem BioAssay
LigandPNGBDBM44512(2-(7-Methyl-2-piperidin-1-yl-quinolin-3-ylmethylen...)
Affinity DataIC50:  3.21E+3nM. Assay description: NIH Molecular Libraries Screening Centers Network [MLSCN] Emory Chemical Biology Discovery Center in MLSCN Assay provider: Theodore Jardetzky; Northw...
In DepthDetails PCBioAssay
TargetEphrin type-A receptor 4(Mus musculus)
Sanford-Burnham Center For Chemical Genomics
Curated by PubChem BioAssay
LigandPNGBDBM44512(2-(7-Methyl-2-piperidin-1-yl-quinolin-3-ylmethylen...)
Affinity DataIC50: >5.00E+4nM. Assay description: Sanford-Burnham Center for Chemical Genomics (SBCCG) Sanford-Burnham Medical Research Institute (SBMRI, San Diego, CA) NIH Molecular Libraries Screen...
In DepthDetails PCBioAssay