BDBM44516 1-(1,5-dimethyl-3-oxidanylidene-2-phenyl-pyrazol-4-yl)-3-[(3-hydroxyphenyl)methylideneamino]thiourea::1-(1,5-dimethyl-3-oxo-2-phenyl-4-pyrazolyl)-3-[(3-hydroxyphenyl)methylideneamino]thiourea::1-(1,5-dimethyl-3-oxo-2-phenylpyrazol-4-yl)-3-[(3-hydroxyphenyl)methylideneamino]thiourea::1-[(3-hydroxybenzylidene)amino]-3-(3-keto-1,5-dimethyl-2-phenyl-3-pyrazolin-4-yl)thiourea::3-hydroxybenzaldehyde N-(1,5-dimethyl-3-oxo-2-phenyl-2,3-dihydro-1H-pyrazol-4-yl)thiosemicarbazone::MLS000578203::SMR000186097::cid_1180673
SMILES Cc1c(NC(=S)NN=Cc2cccc(O)c2)c(=O)n(-c2ccccc2)n1C
InChI Key InChIKey=HAIOJBZAOLZSHF-UHFFFAOYSA-N
Data  2 IC50
  Tab Delimited (TSV)   2D SDfile   Computed 3D by Vconf -m prep SDfile
Find this compound or compounds like it in BindingDB:
Activity Spreadsheet -- Enzyme Inhibition Constant Data from BindingDB
Found 2 hits for monomerid = 44516
TargetEphrin type-A receptor 4(Mus musculus)
Burnham Center For Chemical Genomics
Curated by PubChem BioAssay
LigandPNGBDBM44516(1-(1,5-dimethyl-3-oxidanylidene-2-phenyl-pyrazol-4...)
Affinity DataIC50: >5.00E+4nM. Assay description: Sanford-Burnham Center for Chemical Genomics (SBCCG) Sanford-Burnham Medical Research Institute (SBMRI, San Diego, CA) NIH Molecular Libraries Screen...
In DepthDetails PCBioAssay
TargetEphrin type-A receptor 4(Mus musculus)
Burnham Center For Chemical Genomics
Curated by PubChem BioAssay
LigandPNGBDBM44516(1-(1,5-dimethyl-3-oxidanylidene-2-phenyl-pyrazol-4...)
Affinity DataIC50:  3.95E+4nM. Assay description: Data Source: Sanford-Burnham Center for Chemical Genomics (SBCCG) Source Affiliation: Sanford-Burnham Medical Research Institute (SBMRI, San Diego, C...
In DepthDetails PCBioAssay