BDBM44522 2-[[4-allyl-5-(4-pyridyl)-1,2,4-triazol-3-yl]thio]-N-[5-[2-chloro-5-(trifluoromethyl)benzyl]thiazol-2-yl]acetamide::2-{[4-allyl-5-(4-pyridinyl)-4H-1,2,4-triazol-3-yl]thio}-N-{5-[2-chloro-5-(trifluoromethyl)benzyl]-1,3-thiazol-2-yl}acetamide::MLS000582714::N-[5-[[2-chloranyl-5-(trifluoromethyl)phenyl]methyl]-1,3-thiazol-2-yl]-2-[(4-prop-2-enyl-5-pyridin-4-yl-1,2,4-triazol-3-yl)sulfanyl]ethanamide::N-[5-[[2-chloro-5-(trifluoromethyl)phenyl]methyl]-1,3-thiazol-2-yl]-2-[(4-prop-2-enyl-5-pyridin-4-yl-1,2,4-triazol-3-yl)sulfanyl]acetamide::N-[5-[[2-chloro-5-(trifluoromethyl)phenyl]methyl]-2-thiazolyl]-2-[(4-prop-2-enyl-5-pyridin-4-yl-1,2,4-triazol-3-yl)thio]acetamide::SMR000201417::cid_1187792
SMILES FC(F)(F)c1ccc(Cl)c(Cc2cnc(NC(=O)CSc3nnc(-c4ccncc4)n3CC=C)s2)c1
InChI Key InChIKey=RUQVTQALOFGOPD-UHFFFAOYSA-N
Data  2 IC50
  Tab Delimited (TSV)   2D SDfile   Computed 3D by Vconf -m prep SDfile
Find this compound or compounds like it in BindingDB:
Activity Spreadsheet -- Enzyme Inhibition Constant Data from BindingDB
Found 2 hits for monomerid = 44522
TargetEphrin type-A receptor 4(Mus musculus)
Burnham Center For Chemical Genomics
Curated by PubChem BioAssay
LigandPNGBDBM44522(2-[[4-allyl-5-(4-pyridyl)-1,2,4-triazol-3-yl]thio]...)
Affinity DataIC50: >5.00E+4nM. Assay description: Sanford-Burnham Center for Chemical Genomics (SBCCG) Sanford-Burnham Medical Research Institute (SBMRI, San Diego, CA) NIH Molecular Libraries Screen...
In DepthDetails PCBioAssay
TargetEphrin type-A receptor 4(Mus musculus)
Burnham Center For Chemical Genomics
Curated by PubChem BioAssay
LigandPNGBDBM44522(2-[[4-allyl-5-(4-pyridyl)-1,2,4-triazol-3-yl]thio]...)
Affinity DataIC50: >1.00E+5nM. Assay description: Data Source: Sanford-Burnham Center for Chemical Genomics (SBCCG) Source Affiliation: Sanford-Burnham Medical Research Institute (SBMRI, San Diego, C...
In DepthDetails PCBioAssay