BDBM44724 1-[5-[(E)-2-(dimethylamino)vinyl]-3-methyl-isoxazol-4-yl]sulfonyl-N-(2-methylcyclohexyl)nipecotamide::1-[[5-[(E)-2-(dimethylamino)ethenyl]-3-methyl-1,2-oxazol-4-yl]sulfonyl]-N-(2-methylcyclohexyl)piperidine-3-carboxamide::1-[[5-[(E)-2-(dimethylamino)ethenyl]-3-methyl-4-isoxazolyl]sulfonyl]-N-(2-methylcyclohexyl)-3-piperidinecarboxamide::MLS000118818::SMR000095758::cid_5308588
SMILES CC1CCCCC1NC(=O)C1CCCN(C1)S(=O)(=O)c1c(C)noc1\C=C\N(C)C
InChI Key InChIKey=PPZYXLPJPZNQIS-ACCUITESSA-N
Data  1 EC50
  Tab Delimited (TSV)   2D SDfile   Computed 3D by Vconf -m prep SDfile
Find this compound or compounds like it in BindingDB:
Activity Spreadsheet -- Enzyme Inhibition Constant Data from BindingDB
Found 1 hit for monomerid = 44724
TargetMultidrug resistance-associated protein 1(Homo sapiens (Human))
Srmlsc
Curated by PubChem BioAssay
LigandPNGBDBM44724(1-[5-[(E)-2-(dimethylamino)vinyl]-3-methyl-isoxazo...)
Affinity DataEC50:  4.98E+3nM. Assay description: Southern Research Molecular Libraries Screening Center (SRMLSC) Southern Research Institute (Birmingham, Alabama) NIH Molecular Libraries Screening C...
In DepthDetails PCBioAssay