BDBM448302 MI-17
SMILES O=C[C@H](C[C@@H]1CCNC1=O)NC(=O)[C@H]1[C@@H]2CCC[C@H]2CN1C(=O)c1cc2ccccn2n1
InChI Key InChIKey=CFLPDEMDXINBKA-ZMHQTACCSA-N
Data  1 IC50
  Tab Delimited (TSV)   2D SDfile   Computed 3D by Vconf -m prep SDfile
Find this compound or compounds like it in BindingDB:
Activity Spreadsheet -- Enzyme Inhibition Constant Data from BindingDB
Found 1 hit for monomerid = 448302
TargetReplicase polyprotein 1ab(2019-nCoV)
Sichuan University
LigandPNGBDBM448302(MI-17)
Affinity DataIC50:  299nM. Assay description: The enzymatic inhibition assay was carried out with a final concentration of 100 nM recombinant SARS-CoV-2 Mpro and 20 μM FRET substrate. For th...
Ligand InfoPC cidPC sid
In DepthDetails ArticlePubMed