BDBM448375 Perampanel, 27
SMILES FC(F)(F)CCOc1cc(Cl)cc(c1)C1C=C(C(=O)N(C1=O)c1cccnc1)c1ccccc1C#N
InChI Key InChIKey=IDHAQBVYXKCMSF-UHFFFAOYSA-N
Data  1 IC50  1 EC50
  Tab Delimited (TSV)   2D SDfile   Computed 3D by Vconf -m prep SDfile
Find this compound or compounds like it in BindingDB:
Activity Spreadsheet -- Enzyme Inhibition Constant Data from BindingDB
Found 2 hits for monomerid = 448375
TargetReplicase polyprotein 1ab(2019-nCoV)
Yale University
LigandPNGBDBM448375(Perampanel, 27)
Affinity DataEC50:  1.10E+3nM. Assay description: The antiviral activity of compounds was examined by evaluating the cytopathic effect in Vero-E6 cells grown at 37°C in a 5% CO2 atmosphere for 72 h u...
Ligand InfoPC cidPC sid
In DepthDetails Article
TargetReplicase polyprotein 1ab(2019-nCoV)
Yale University
LigandPNGBDBM448375(Perampanel, 27)
Affinity DataIC50:  120nM. Assay description: Inhibition of proteolytic activity was tested using recombinant SARS-CoV-2Mpro, which was expressed and purified as previously described.8,12 For the...
Ligand InfoPC cidPC sid
In DepthDetails Article