BDBM45109 2-(4-Acetoxy-benzylidene)-7-methyl-3-oxo-5-styryl-2,3-dihydro-5H-thiazolo[3,2-a]pyrimidine-6-carboxylic acid ethyl ester::2-(4-acetoxybenzylidene)-3-keto-7-methyl-5-[(E)-styryl]-5H-thiazolo[3,2-a]pyrimidine-6-carboxylic acid ethyl ester::2-[(4-acetyloxyphenyl)methylidene]-7-methyl-3-oxo-5-[(E)-2-phenylethenyl]-5H-thiazolo[3,2-a]pyrimidine-6-carboxylic acid ethyl ester::MLS000559781::SMR000175745::cid_12004743::ethyl 2-[(4-acetyloxyphenyl)methylidene]-7-methyl-3-oxidanylidene-5-[(E)-2-phenylethenyl]-5H-[1,3]thiazolo[3,2-a]pyrimidine-6-carboxylate::ethyl 2-[(4-acetyloxyphenyl)methylidene]-7-methyl-3-oxo-5-[(E)-2-phenylethenyl]-5H-[1,3]thiazolo[3,2-a]pyrimidine-6-carboxylate
SMILES CCOC(=O)C1=C(C)N=c2sc(=Cc3ccc(OC(C)=O)cc3)c(=O)n2C1\C=C\c1ccccc1
InChI Key InChIKey=RHJCNONRUZIWBT-PMRKBDKDSA-N
Data  1 EC50
  Tab Delimited (TSV)   2D SDfile   Computed 3D by Vconf -m prep SDfile
Find this compound or compounds like it in BindingDB:
Activity Spreadsheet -- Enzyme Inhibition Constant Data from BindingDB
Found 1 hit for monomerid = 45109
TargetMultidrug resistance-associated protein 1(Homo sapiens (Human))
Srmlsc
Curated by PubChem BioAssay
LigandPNGBDBM45109(2-(4-Acetoxy-benzylidene)-7-methyl-3-oxo-5-styryl-...)
Affinity DataEC50:  1.86E+3nM. Assay description: Southern Research Molecular Libraries Screening Center (SRMLSC) Southern Research Institute (Birmingham, Alabama) NIH Molecular Libraries Screening C...
In DepthDetails PCBioAssay