BDBM451349 US10709709, Example 179
SMILES Cc1cn([C@@H]2C[C@H](Oc3cc(F)c(F)c4CCNCc34)[C@@H](O)[C@H]2O)c2nc(C)nc(N)c12
InChI Key InChIKey=OFECTUFSHJFIMI-MWHZBGGUSA-N
Data  1 IC50
  Tab Delimited (TSV)   2D SDfile   Computed 3D by Vconf -m prep SDfile
Find this compound or compounds like it in BindingDB:
Activity Spreadsheet -- Enzyme Inhibition Constant Data from BindingDB
Found 1 hit for monomerid = 451349
TargetProtein arginine N-methyltransferase 5(Homo sapiens (Human))
Pfizer
US Patent
LigandPNGBDBM451349(US10709709, Example 179)
Affinity DataIC50:  1nM. Assay description: Compounds were solubilized in DMSO and serially diluted, using 3-fold dilutions, into 100% DMSO at a concentration 50-fold greater than the desired a...
Ligand InfoPC cidPC sid
In DepthDetails US Patent