BDBM4547 4-Phenylamino-3-quinolinecarbonitrile deriv. 2g::4-[(2-Chloro-5-methoxy-4-methylphenyl)amino]-6-methoxy-7-[3-(4-morpholinyl)propoxy]-3-quinolinecarbonitrile::4-[(2-chloro-5-methoxy-4-methylphenyl)amino]-6-methoxy-7-[3-(morpholin-4-yl)propoxy]quinoline-3-carbonitrile
SMILES COc1cc(Nc2c(cnc3cc(OCCCN4CCOCC4)c(OC)cc23)C#N)c(Cl)cc1C
InChI Key InChIKey=DCIXGXIYPVJPIL-UHFFFAOYSA-N
Data  1 IC50
  Tab Delimited (TSV)   2D SDfile   Computed 3D by Vconf -m prep SDfile
Find this compound or compounds like it in BindingDB:
Activity Spreadsheet -- Enzyme Inhibition Constant Data from BindingDB
Found 1 hit for monomerid = 4547
TargetProto-oncogene tyrosine-protein kinase Src(Homo sapiens (Human))
Wyeth-Ayerst Research
LigandPNGBDBM4547(4-Phenylamino-3-quinolinecarbonitrile deriv. 2g | ...)
Affinity DataIC50:  1.10nM. Assay description: Src kinase activity was measured in an ELISA format. IC50 is the inhibitor concentration which inhibits 50% of kinase activity that catalyzes the tra...
In DepthDetails ArticlePubMed