BDBM45759 4-(3-keto-1,2-benzothiazol-2-yl)-N,N-dimethyl-benzamide::AB00540091::N,N-dimethyl-4-(3-oxidanylidene-1,2-benzothiazol-2-yl)benzamide::N,N-dimethyl-4-(3-oxo-1,2-benzothiazol-2-yl)benzamide::cid_16749983
SMILES CN(C)C(=O)c1ccc(cc1)-n1sc2ccccc2c1=O
InChI Key InChIKey=ZRWXXJMBGSOSSR-UHFFFAOYSA-N
Data  1 IC50
  Tab Delimited (TSV)   2D SDfile   Computed 3D by Vconf -m prep SDfile
Find this compound or compounds like it in BindingDB:
Activity Spreadsheet -- Enzyme Inhibition Constant Data from BindingDB
Found 1 hit for monomerid = 45759
TargetDiphosphomevalonate decarboxylase(Streptococcus pneumoniae D39)
Srmlsc
Curated by PubChem BioAssay
LigandPNGBDBM45759(4-(3-keto-1,2-benzothiazol-2-yl)-N,N-dimethyl-benz...)
Affinity DataIC50:  2.85E+3nM. Assay description: Southern Research Molecular Libraries Screening Center (SRMLSC) Southern Research Institute (Birmingham, Alabama) NIH Molecular Libraries Screening...
In DepthDetails PCBioAssay