BDBM46043 2-(2,5-dimethylphenyl)-1,2-benzothiazol-3-one::MLS-0315860.0001::cid_25067462
SMILES Cc1ccc(C)c(c1)-n1sc2ccccc2c1=O
InChI Key InChIKey=KZWDYISQJWCAHU-UHFFFAOYSA-N
Data  8 IC50
  Tab Delimited (TSV)   2D SDfile   Computed 3D by Vconf -m prep SDfile
Find this compound or compounds like it in BindingDB:
Activity Spreadsheet -- Enzyme Inhibition Constant Data from BindingDB
Found 8 hits for monomerid = 46043
TargetAlkaline phosphatase, tissue-nonspecific isozyme(Homo sapiens (Human))
Burnham Center For Chemical Genomics
Curated by PubChem BioAssay
LigandPNGBDBM46043(2-(2,5-dimethylphenyl)-1,2-benzothiazol-3-one | ML...)
Affinity DataIC50: >1.00E+5nM. Assay description: Sanford-Burnham Center for Chemical Genomics (SBCCG) Sanford-Burnham Medical Research Institute (SBMRI, San Diego, CA) NIH Molecular Libraries Screen...
In DepthDetails PCBioAssay
TargetMannose-6-phosphate isomerase(Homo sapiens (Human))
Burnham Center For Chemical Genomics
Curated by PubChem BioAssay
LigandPNGBDBM46043(2-(2,5-dimethylphenyl)-1,2-benzothiazol-3-one | ML...)
Affinity DataIC50:  5.51E+3nM. Assay description: Data Source: Sanford-Burnham Center for Chemical Genomics (SBCCG) Source Affiliation: Sanford-Burnham Medical Research Institute (SBMRI, San Diego, C...
In DepthDetails PCBioAssay
TargetPhosphomannomutase 2(Homo sapiens (Human))
Burnham Center For Chemical Genomics
Curated by PubChem BioAssay
LigandPNGBDBM46043(2-(2,5-dimethylphenyl)-1,2-benzothiazol-3-one | ML...)
Affinity DataIC50:  1.79E+4nM. Assay description: Data Source: Sanford-Burnham Center for Chemical Genomics (SBCCG) Source Affiliation: Sanford-Burnham Medical Research Institute (SBMRI, San Diego, C...
In DepthDetails PCBioAssay
TargetMannose-6-phosphate isomerase(Homo sapiens (Human))
Burnham Center For Chemical Genomics
Curated by PubChem BioAssay
LigandPNGBDBM46043(2-(2,5-dimethylphenyl)-1,2-benzothiazol-3-one | ML...)
Affinity DataIC50:  6.60E+3nM. Assay description: Inhibition of phosphomannose isomerase (unknown origin)
In DepthDetails ArticlePubMed
TargetMannose-6-phosphate isomerase(Homo sapiens (Human))
Burnham Center For Chemical Genomics
Curated by PubChem BioAssay
LigandPNGBDBM46043(2-(2,5-dimethylphenyl)-1,2-benzothiazol-3-one | ML...)
Affinity DataIC50:  1.67E+3nM. Assay description: Data Source: Sanford-Burnham Center for Chemical Genomics (SBCCG) Source Affiliation: Sanford-Burnham Medical Research Institute (SBMRI, San Diego, C...
In DepthDetails PCBioAssay
TargetPhosphoethanolamine/phosphocholine phosphatase(Homo sapiens (Human))
Sanford-Burnham Medical Research Institute
Curated by ChEMBL
LigandPNGBDBM46043(2-(2,5-dimethylphenyl)-1,2-benzothiazol-3-one | ML...)
Affinity DataIC50:  4.00E+3nM. Assay description: Inhibition of PHOSPHO1 phosphoethanolamine activity (unknown origin) assessed as amount of inorganic phosphate release after 30 mins
In DepthDetails ArticlePubMed
TargetPhosphomannomutase 2(Homo sapiens (Human))
Burnham Center For Chemical Genomics
Curated by PubChem BioAssay
LigandPNGBDBM46043(2-(2,5-dimethylphenyl)-1,2-benzothiazol-3-one | ML...)
Affinity DataIC50: >2.00E+4nM. Assay description: Inhibition of PMM2 (unknown origin)
In DepthDetails ArticlePubMed
TargetPhosphoethanolamine/phosphocholine phosphatase(Homo sapiens (Human))
Sanford-Burnham Medical Research Institute
Curated by ChEMBL
LigandPNGBDBM46043(2-(2,5-dimethylphenyl)-1,2-benzothiazol-3-one | ML...)
Affinity DataIC50:  5.04E+3nM. Assay description: Data Source: Sanford-Burnham Center for Chemical Genomics (SBCCG) Source Affiliation: Sanford-Burnham Medical Research Institute (SBMRI, San Diego, C...
In DepthDetails PCBioAssay