BDBM46198 1-[2,3-bis(2-furanyl)-6-quinoxalinyl]-3-cyclopentylurea::1-[2,3-bis(2-furyl)quinoxalin-6-yl]-3-cyclopentyl-urea::1-[2,3-bis(furan-2-yl)quinoxalin-6-yl]-3-cyclopentyl-urea::1-[2,3-bis(furan-2-yl)quinoxalin-6-yl]-3-cyclopentylurea::MLS-0292136.0001::cid_24178233
SMILES O=C(NC1CCCC1)Nc1ccc2nc(-c3ccco3)c(nc2c1)-c1ccco1
InChI Key InChIKey=LQWYCQSEQUJHKE-UHFFFAOYSA-N
Data  2 IC50
  Tab Delimited (TSV)   2D SDfile   Computed 3D by Vconf -m prep SDfile
Find this compound or compounds like it in BindingDB:
Activity Spreadsheet -- Enzyme Inhibition Constant Data from BindingDB
Found 2 hits for monomerid = 46198
TargetTyrosine-protein phosphatase non-receptor type 7(Homo sapiens (Human))
Burnham Center For Chemical Genomics
Curated by PubChem BioAssay
LigandPNGBDBM46198(1-[2,3-bis(2-furanyl)-6-quinoxalinyl]-3-cyclopenty...)
Affinity DataIC50:  1.10E+3nM. Assay description: Data Source: Sanford-Burnham Center for Chemical Genomics (SBCCG) Source Affiliation: Sanford-Burnham Medical Research Institute (SBMRI, San Diego, C...
In DepthDetails PCBioAssay
TargetTyrosine-protein phosphatase non-receptor type 7(Homo sapiens (Human))
Burnham Center For Chemical Genomics
Curated by PubChem BioAssay
LigandPNGBDBM46198(1-[2,3-bis(2-furanyl)-6-quinoxalinyl]-3-cyclopenty...)
Affinity DataIC50:  2.56E+3nM. Assay description: Data Source: Sanford-Burnham Center for Chemical Genomics (SBCCG) Source Affiliation: Sanford-Burnham Medical Research Institute (SBMRI, San Diego, C...
In DepthDetails PCBioAssay