BDBM462713 US10780090, Compound I-49::[(1R,2S,4R)-4-{[5-({5-chloro-4-[(1R)-1-(3-chlorophenyl)-1,3-dihydroxypropyl]-2- thienyl}carbonyl)pyrimidin-4-yl]amino}-2-hydroxycyclopentyl]methyl sulfamate
SMILES NS(=O)(=O)OC[C@H]1C[C@H](C[C@@H]1O)Nc1ncncc1C(=O)c1cc([C@@H](O)c2cc(Cl)ccc2F)c(Cl)s1
InChI Key InChIKey=LZIPLCNHVPKVNN-SKCMXINMSA-N
Data  1 IC50
  Tab Delimited (TSV)   2D SDfile   Computed 3D by Vconf -m prep SDfile
Find this compound or compounds like it in BindingDB:
Activity Spreadsheet -- Enzyme Inhibition Constant Data from BindingDB
Found 1 hit for monomerid = 462713
TargetSUMO-activating enzyme subunit 1(Homo sapiens (Human))
Millennium Pharmaceuticals
US Patent
LigandPNGBDBM462713(US10780090, Compound I-49 | [(1R,2S,4R)-4-{[5-({5-...)
Affinity DataIC50: <10nM. Assay description: The SAE enzymatic reaction totals 50 μl and contains 50 mM HEPES Hemisodium (pH 7.5), 0.05% BSA, 5 mM MgCl2, 0.5 μM ATP, 250 μM GSH, 0...
Ligand InfoPC cidPC sid
In DepthDetails US Patent