BDBM46275 2-[2-chloro-4-[(Z)-[2,4-diketo-3-[2-keto-2-(p-toluidino)ethyl]thiazolidin-5-ylidene]methyl]-6-ethoxy-phenoxy]acetic acid methyl ester::2-[2-chloro-6-ethoxy-4-[(Z)-[3-[2-(4-methylanilino)-2-oxoethyl]-2,4-dioxo-5-thiazolidinylidene]methyl]phenoxy]acetic acid methyl ester::MLS-0425589.0001::cid_5989418::methyl 2-[2-chloranyl-6-ethoxy-4-[(Z)-[3-[2-[(4-methylphenyl)amino]-2-oxidanylidene-ethyl]-2,4-bis(oxidanylidene)-1,3-thiazolidin-5-ylidene]methyl]phenoxy]ethanoate::methyl 2-[2-chloro-6-ethoxy-4-[(Z)-[3-[2-(4-methylanilino)-2-oxoethyl]-2,4-dioxo-1,3-thiazolidin-5-ylidene]methyl]phenoxy]acetate
SMILES CCOc1cc(\C=C2/SC(=O)N(CC(=O)Nc3ccc(C)cc3)C2=O)cc(Cl)c1OCC(=O)OC
InChI Key InChIKey=PIEFYIFNORKLLX-ODLFYWEKSA-N
Data  6 IC50
  Tab Delimited (TSV)   2D SDfile   Computed 3D by Vconf -m prep SDfile
Find this compound or compounds like it in BindingDB:
Activity Spreadsheet -- Enzyme Inhibition Constant Data from BindingDB
Found 6 hits for monomerid = 46275
TargetTyrosine-protein phosphatase non-receptor type 7(Homo sapiens (Human))
Burnham Center For Chemical Genomics
Curated by PubChem BioAssay
LigandPNGBDBM46275(2-[2-chloro-4-[(Z)-[2,4-diketo-3-[2-keto-2-(p-tolu...)
Affinity DataIC50:  7.51E+3nM. Assay description: Data Source: Sanford-Burnham Center for Chemical Genomics (SBCCG) Source Affiliation: Sanford-Burnham Medical Research Institute (SBMRI, San Diego, C...
In DepthDetails PCBioAssay
TargetTyrosine-protein phosphatase non-receptor type 7(Homo sapiens (Human))
Burnham Center For Chemical Genomics
Curated by PubChem BioAssay
LigandPNGBDBM46275(2-[2-chloro-4-[(Z)-[2,4-diketo-3-[2-keto-2-(p-tolu...)
Affinity DataIC50:  1.79E+4nM. Assay description: Data Source: Sanford-Burnham Center for Chemical Genomics (SBCCG) Source Affiliation: Sanford-Burnham Medical Research Institute (SBMRI, San Diego, C...
In DepthDetails PCBioAssay
TargetDNA (cytosine-5)-methyltransferase 3A(Homo sapiens (Human))
Burnham Center For Chemical Genomics
Curated by PubChem BioAssay
LigandPNGBDBM46275(2-[2-chloro-4-[(Z)-[2,4-diketo-3-[2-keto-2-(p-tolu...)
Affinity DataIC50: >1.00E+5nM. Assay description: Data Source: Sanford-Burnham Center for Chemical Genomics (SBCCG) Source Affiliation: Sanford-Burnham Medical Research Institute (SBMRI, San Diego, C...
In DepthDetails PCBioAssay
TargetTyrosine-protein phosphatase non-receptor type 22(Homo sapiens (Human))
Burnham Center For Chemical Genomics
Curated by PubChem BioAssay
LigandPNGBDBM46275(2-[2-chloro-4-[(Z)-[2,4-diketo-3-[2-keto-2-(p-tolu...)
Affinity DataIC50: >1.00E+5nM. Assay description: Data Source: Sanford-Burnham Center for Chemical Genomics (SBCCG) Source Affiliation: Sanford-Burnham Medical Research Institute(SBMRI, San Diego, CA...
In DepthDetails PCBioAssay
TargetTyrosine-protein phosphatase non-receptor type 7(Homo sapiens (Human))
Burnham Center For Chemical Genomics
Curated by PubChem BioAssay
LigandPNGBDBM46275(2-[2-chloro-4-[(Z)-[2,4-diketo-3-[2-keto-2-(p-tolu...)
Affinity DataIC50:  9.66E+3nM. Assay description: Data Source: Sanford-Burnham Center for Chemical Genomics (SBCCG) Source Affiliation: Sanford-Burnham Medical Research Institute (SBMRI, San Diego, C...
In DepthDetails PCBioAssay
TargetTyrosine-protein phosphatase non-receptor type 22(Homo sapiens (Human))
Burnham Center For Chemical Genomics
Curated by PubChem BioAssay
LigandPNGBDBM46275(2-[2-chloro-4-[(Z)-[2,4-diketo-3-[2-keto-2-(p-tolu...)
Affinity DataIC50: >1.00E+5nM. Assay description: Data Source: Sanford-Burnham Center for Chemical Genomics (SBCCG) Source Affiliation: Sanford-Burnham Medical Research Institute (SBMRI, San Diego, C...
In DepthDetails PCBioAssay